program: Gaussian 09
title: 000179212
version: EM64L-G09RevD.01
frameworkgroup: C1[X(C3H5N3O2)]
method: RPBEPBE
basis: SDD
operation: Freq
keyword: #pfreq=noraman
keyword: PBEPBE/SDD
title: #p freq=noraman PBEPBE/SDD
converged: NO NO NO NO
title: Mulliken charges:
elementType: O O N N N C C C H H H H H
charge: -0.265740 -0.251693 -0.069457 -0.321569 -0.450661 0.265246 0.241471 -0.621067 0.344777 0.364473 0.240508 0.240685 0.283028
chargesum: 0.00000
title: Mulliken charges with hydrogens summed into heavy atoms:
elementType: O O N N N C C C
charge: -0.265740 -0.251693 -0.069457 0.023208 -0.086188 0.265246 0.241471 0.143154
polarizability: 7.75298440e+01 1.71947313e+00 6.31573699e+01 -5.76265782e-03 1.77642754e-02 3.02550661e+01
1716.lowfreq: -244.7411 -19.0645 -10.2753 0.0005 0.0005 0.0010 10.5804 110.9154 178.9152
frequency: -244.7383 110.9148 178.9151 212.8621 261.3445 350.4687 354.0087 542.7185 594.3781 612.3509 655.1009 668.4714 716.8659 811.2694 978.1939 1020.9654 1102.9236 1130.3064 1241.1907 1264.8951 1297.8356 1319.4467 1413.6683 1449.3839 1469.8349 1495.8997 1687.4906 1720.6246 2970.8942 3049.8570 3104.2838 3637.4758 3643.4379
redmass: 1.8173 5.1144 1.0392 8.6007 3.1503 1.9397 10.7915 4.3844 1.0796 8.1529 12.0626 7.1276 11.8608 4.2786 3.5492 1.9525 5.6616 1.2787 2.0966 3.2638 1.5749 7.5651 1.5724 1.5590 1.0417 1.1965 7.1366 10.0890 1.0345 1.1032 1.0976 1.0811 1.0834
irintensity: 61.2449 10.4759 0.0002 16.5833 2.8844 68.8021 14.6929 12.5481 174.5275 11.2256 0.0405 4.1268 36.9146 6.2423 21.4790 2.6798 23.3626 0.0794 33.0126 62.7498 1.7430 151.8785 19.6813 73.4765 20.9338 4.6660 815.9502 241.3189 66.4417 32.8192 2.3226 108.4715 66.7480
temp: 298.150 k
press: 1.00000 atm
elementType: 8 8 7 7 7 6 6 6 1 1 1 1 1
symmnumber: 1
zpe: 245642.8 jmol-1
zpe.correction: 0.093560 hartree
zpe.thermalcorrener: 0.100578 hartree
zpe.thermalcorrenthalpy: 0.101522 hartree
zpe.thermalcorrgfe: 0.062141 hartree
zpe.sumelectzpe: -431.418571 hartree
zpe.sumelectthermal: -431.411553 hartree
zpe.sumelectthermalent: -431.410609 hartree
zpe.sumelectthermalfe: -431.449991 hartree
dipole: 2.0957 -3.5881 -0.0005
dipole: 4.1553
quadrupole: -58.9419 -40.0192 -46.6681
quadrupole: -10.5501 0.0128 0.0220
quadrupole: -10.3988 8.5239 1.8749 -10.5501 0.0128 0.0220
hfenergy: -431.5121313 hartree
pointgroup: C01 [X(C3H5N3O2)]
dipole: -0.7472039 1.4540795 -0.0005541 debye
dipolederiv: -0.9584298 -0.5094467 -0.0020039 -0.3525501 -0.9028787 -0.0014867 0.0026398 0.0029352 -0.3886387 -1.4688819 0.0385745 0.0014559 -0.0628863 -0.4789127 0.0000757 -0.0049376 0.0001815 -0.3879114 -0.3118752 0.498429 0.0006578 0.1116616 -0.8046558 0.0018561 -0.0016401 0.0039374 -0.1734563 -0.4276959 0.0337039 0.0004872 0.48525 -0.7091314 -0.0008201 0.0023686 -0.0048191 -0.3771502 -1.2760382 -0.2010013 -0.0004405 -0.2707862 -0.6105399 -0.0008822 -0.0009422 0.0009286 -0.4033091 1.5871545 0.4473996 0.0037952 0.2520086 1.5428254 -0.0000335 0.0008462 -0.0034332 0.2958715 2.0718138 0.0238054 -0.0017082 0.0825324 1.1072339 -0.0000979 0.0028691 -0.0002612 0.329565 0.2551839 -0.3885129 -0.0011437 -0.3309223 0.3587622 0.0006178 -0.0008342 -0.001009 0.2905329 0.1640878 0.0187484 -0.0003078 0.015399 0.2525387 0.0004189 -0.0002986 0.0016074 0.4097894 0.1769405 -0.0325446 -0.0003253 -0.04084 0.26533 0.0002215 -0.0004729 0.0001913 0.3903554 0.0759001 0.0397818 0.0393175 0.1052621 -0.0489907 0.1005146 -0.0289899 0.1440369 -0.0672464 0.0759411 0.0402103 -0.0397342 0.1048474 -0.0474025 -0.1000543 0.0295249 -0.1439929 -0.0688816 0.0358994 -0.0091473 -0.0000499 -0.0989762 0.0758215 -0.0003299 -0.0001332 -0.0003028 0.1504796 unknown
polarizability: 77.6732049|0.9355941|63.0139918|0.0296469|-0.0167718|30.2550833 unknown
InChI: InChI=1S/C3H5N3O2/c1-6-3(8)4-2(7)5-6/h4-5H,1H3
charge 0 multiplicity 1
13 atoms
O  -1.755147 -1.557795 -0.001332
O  2.709351 0.113919 0.002267
N  -0.793564 0.621709 -0.004238
N  0.541106 1.111209 -0.001181
N  0.616413 -1.092069 0.001378
C  -0.767126 -0.778203 -0.004651
C  1.454667 0.052051 -0.002166
C  -1.965193 1.479295 0.000865
H  0.761363 2.102937 -0.002982
H  0.970171 -2.045447 0.006299
H  -2.00618 2.119391 -0.900529
H  -2.003909 2.11235 0.907367
H  -2.841254 0.809654 -0.000696
