program: Gaussian 09
title: 000016009
version: EM64L-G09RevD.01
frameworkgroup: C1[X(C8H12O5)]
method: RPBEPBE
basis: SDD
operation: Freq
keyword: #pfreq=noraman
keyword: PBEPBE/SDD
title: #p freq=noraman PBEPBE/SDD
converged: YES YES NO NO
title: Mulliken charges:
elementType: O O O O O C C C C C C C C H H H H H H H H H H H H
charge: -0.152928 -0.201714 -0.202149 -0.416899 -0.237468 0.320322 -0.687016 -0.704790 -0.687041 0.264513 -0.253710 -0.227389 0.187593 0.230982 0.208414 0.237939 0.239683 0.239595 0.212076 0.237993 0.208424 0.230935 0.279029 0.289504 0.384100
chargesum: 0.00000
title: Mulliken charges with hydrogens summed into heavy atoms:
elementType: O O O O O C C C C C C C C
charge: -0.152928 -0.201714 -0.202149 -0.032800 -0.237468 0.320322 -0.009680 -0.013435 -0.009689 0.264513 0.025319 0.062115 0.187593
polarizability: 2.00278164e+02 -2.58264313e+00 1.01366751e+02 -1.15803632e-02 3.05837507e-03 6.77982266e+01
1716.lowfreq: -16.7955 -8.0934 -0.0009 -0.0008 -0.0006 1.5982 13.4907 29.8836 53.8259
frequency: 7.1608 29.4634 53.7994 55.4821 103.9295 137.9554 139.8994 162.7839 204.5417 207.9302 214.2149 245.4320 253.4375 265.4819 324.7485 349.9722 408.3171 438.4512 464.7418 526.6419 564.2179 573.7933 637.9200 668.5124 715.8766 743.4726 789.3270 852.3344 882.9525 908.8965 913.3516 919.8510 954.0445 956.0967 1003.1810 1024.6825 1027.2595 1042.7850 1069.2830 1179.9493 1221.3130 1255.7704 1261.7821 1281.0110 1328.5839 1375.5656 1377.3160 1399.6187 1442.1874 1462.6807 1465.2909 1469.3097 1469.9888 1496.6421 1636.3329 1653.4316 1658.4353 2993.3920 2995.3068 2999.3779 3089.6322 3093.1404 3101.2770 3102.0121 3107.7081 3108.0638 3156.7208 3170.9703 3524.7524
redmass: 4.8877 3.5244 7.3392 5.3973 1.4189 4.8743 2.5859 2.7312 3.2163 1.0767 1.2187 4.3112 3.7924 9.7797 2.6624 2.9789 2.8427 2.9846 3.1384 4.5794 1.8101 6.0994 1.8779 6.4906 7.5577 6.1362 3.8772 6.6777 8.9125 2.1163 1.5935 1.5627 1.2043 3.8319 1.0841 1.4193 1.5057 4.0070 2.1990 2.0708 1.3544 3.0392 3.3621 1.4778 2.3342 1.2105 1.2309 1.2056 1.0469 1.0521 1.0477 1.0544 1.0591 1.0550 8.8804 6.3632 12.3011 1.0356 1.0351 1.0358 1.0993 1.0995 1.0989 1.1012 1.0998 1.1005 1.0941 1.0917 1.0642
irintensity: 0.8289 0.8932 1.1625 1.6635 0.7640 1.1773 1.8558 0.8454 1.7655 0.0023 1.9093 0.8680 1.5684 2.1849 2.0012 0.9663 10.0215 3.1901 12.3093 35.7931 67.6861 34.7327 74.3201 8.6042 46.3608 10.5462 8.4268 0.1195 90.8800 0.0023 0.7980 1.4021 0.0002 35.6039 57.3489 0.1885 0.2030 21.1064 481.5938 163.2096 45.9845 31.0830 20.5692 81.8434 171.2827 31.9670 37.6446 14.1222 0.8755 0.3889 0.7546 6.6342 14.4455 17.8337 234.0442 17.6663 168.6001 18.5251 12.0881 19.6710 7.0118 18.2782 47.9568 0.0094 33.0744 31.1894 0.0837 1.0447 57.6162
temp: 298.150 k
press: 1.00000 atm
elementType: 8 8 8 8 8 6 6 6 6 6 6 6 6 1 1 1 1 1 1 1 1 1 1 1 1
symmnumber: 1
zpe: 500755.5 jmol-1
zpe.correction: 0.190728 hartree
zpe.thermalcorrener: 0.206135 hartree
zpe.thermalcorrenthalpy: 0.207079 hartree
zpe.thermalcorrgfe: 0.145242 hartree
zpe.sumelectzpe: -687.077685 hartree
zpe.sumelectthermal: -687.062278 hartree
zpe.sumelectthermalent: -687.061334 hartree
zpe.sumelectthermalfe: -687.123171 hartree
dipole: 1.6730 -2.0151 0.0029
dipole: 2.6191
quadrupole: -52.4580 -87.5659 -75.8123
quadrupole: -5.6042 0.0019 0.0017
quadrupole: 19.4874 -15.6205 -3.8669 -5.6042 0.0019 0.0017
hfenergy: -687.2684131 hartree
pointgroup: C01 [X(C8H12O5)]
dipole: 0.645777 0.8029618 -0.0024559 debye
dipolederiv: -0.4735048 -0.230549 0.0006525 -0.0088092 -0.2390752 -0.0001665 -0.0001298 -0.0003819 -0.3076563 -0.8816705 -0.2560993 0.0000119 -0.6161779 -0.5729839 0.0007424 0.0007011 0.0009243 -0.0969731 -0.5482877 0.0610166 -0.0003012 -0.2972663 -0.9076258 0.0010143 0.0006073 0.0015364 -0.2874982 -1.3045996 -0.5098637 0.0003181 -0.4491211 -0.4957351 -0.0002397 0.0000502 -0.0003865 -0.4304165 -0.7752552 0.1194729 -0.0005943 0.1857928 -0.9342729 0.0012396 -0.0007342 0.0013965 -0.3242862 0.7822142 0.1641297 -0.0004539 0.6157896 0.5043635 0.0004123 -0.0019686 -0.0000414 0.4946671 -0.0682119 0.0276916 0.0334331 -0.0932748 -0.070296 -0.0737668 0.0274503 -0.1001219 -0.1422086 -0.2145205 0.0377357 -0.0002977 -0.2085659 -0.0719744 -0.0000182 0.0011615 0.0002939 0.0203119 -0.0682732 0.0274195 -0.0335445 -0.0937366 -0.0689169 0.0731282 -0.0267344 0.0997105 -0.1436658 1.5085459 0.1738615 0.0005589 0.6939549 1.2562757 -0.0016125 -0.0006167 -0.0020408 0.2460197 -0.071366 0.0828738 -0.0001631 0.0350637 -0.011517 -0.0000934 0.0001524 -0.0001248 -0.1051893 -0.7532613 0.0845475 -0.0006766 0.2447683 0.0292165 -0.0000548 -0.0008993 -0.0002082 -0.0967476 2.1398276 0.1847547 0.0011541 -0.1822677 1.2174921 -0.0019359 0.0018417 -0.0017261 0.2542417 0.1162867 0.0063769 -0.0071923 0.0259366 0.0092433 0.1234331 0.0074932 0.0741475 -0.0844322 -0.0894414 -0.1365347 -0.0121337 -0.1493691 0.0127687 -0.0171578 -0.0084931 0.0008231 0.0872412 -0.0239804 0.1280672 0.0238336 0.1245876 0.0310284 -0.0184941 -0.0120036 -0.0001176 0.0825125 0.1354287 0.0048103 -0.0138488 0.0310129 0.0213772 -0.096964 0.0132946 -0.1187873 -0.0571252 0.1349632 0.0050221 0.0138252 0.0310904 0.0235257 0.0962242 -0.0139131 0.1180445 -0.0595194 -0.1174172 -0.0877907 0.000445 -0.076067 0.0215844 0.0005943 0.0002408 0.0005398 0.1115117 -0.0242824 0.1276833 -0.025241 0.1246157 0.0315696 0.0191948 0.0105804 0.0008234 0.0823189 -0.0890162 -0.1365301 0.0127086 -0.1495336 0.0124282 0.0174119 0.0092978 -0.000624 0.0871329 0.1161291 0.0066965 0.0078936 0.0263973 0.0076972 -0.1241479 -0.006944 -0.0748726 -0.0828753 0.1198597 0.0015932 -0.0000389 0.0082732 0.0087488 0.0003298 -0.0000382 0.0003079 0.1715013 0.1124683 0.0155999 -0.0000814 0.0349909 0.0185621 0.0003342 -0.000049 0.0003177 0.1761433 0.3373647 0.0980146 -0.0002672 0.1419153 0.1665158 0.0005923 -0.0003473 0.0005675 0.4049915 unknown
polarizability: 200.1735258|4.1235029|101.4711784|0.091265|-0.0676933|67.7984366 unknown
InChI: InChI=1S/C8H12O5/c1-8(2,3)13-12-7(11)5-4-6(9)10/h4-5,9H,1-3H3
charge 0 multiplicity 1
25 atoms
O  2.158209 -0.669732 0.004975
O  0.848971 0.125637 0.001501
O  -0.182341 -2.009232 0.005177
O  -5.080637 -0.462007 -0.002277
O  -3.989851 1.597045 -0.005429
C  3.277334 0.344036 0.001823
C  3.218209 1.19866 1.280877
C  4.482869 -0.623761 0.006728
C  3.220308 1.188208 -1.284229
C  -0.250604 -0.767242 0.002201
C  -1.475837 0.07873 -0.000396
C  -2.710859 -0.494317 -0.000193
C  -3.933621 0.343821 -0.002718
H  3.2267 0.555344 2.177488
H  4.091985 1.873629 1.324476
H  2.303814 1.814868 1.300616
H  4.473195 -1.271247 -0.886328
H  4.473774 -1.261678 0.906635
H  5.415531 -0.032206 0.003205
H  2.304812 1.802501 -1.311423
H  4.092922 1.864486 -1.330741
H  3.232553 0.537812 -2.175682
H  -1.36535 1.168817 -0.002428
H  -2.831788 -1.58222 0.001844
H  -5.890401 0.117047 -0.0042
