program: Gaussian 09
title: 000179152
version: EM64L-G09RevD.01
frameworkgroup: C1[X(C12H14O2)]
method: RPBEPBE
basis: SDD
operation: Freq
keyword: #pfreq=noraman
keyword: PBEPBE/SDD
title: #p freq=noraman PBEPBE/SDD
converged: YES YES NO NO
title: Mulliken charges:
elementType: O O C C C C C C C C C C C C H H H H H H H H H H H H H H
charge: -0.440218 -0.237649 -0.357453 -0.248747 -0.315584 0.303503 -0.245556 0.287417 -0.368503 0.164326 -0.546610 -0.542233 -0.438901 -0.434557 0.251766 0.257045 0.283726 0.241892 0.238972 0.234313 0.218924 0.227886 0.233010 0.213291 0.219330 0.208407 0.221221 0.370984
chargesum: 0.00000
title: Mulliken charges with hydrogens summed into heavy atoms:
elementType: O O C C C C C C C C C C C C
charge: -0.069234 -0.237649 -0.105687 0.008298 -0.031858 0.303503 -0.003665 0.287417 -0.129532 0.164326 -0.093373 -0.081337 -0.006281 -0.004929
polarizability: 1.82484003e+02 8.33106144e+00 1.18831168e+02 6.65392158e+00 -4.14216593e+00 1.07997730e+02
1716.lowfreq: -7.2941 -0.0008 -0.0007 0.0004 6.1789 10.6338 38.1422 55.7318 82.6445
frequency: 38.0031 55.7226 82.6211 88.1505 131.9570 165.9162 201.1907 241.7089 284.5709 336.6894 376.3820 423.1188 435.5268 466.5232 560.5060 581.4409 599.4949 659.6947 694.1453 714.8893 734.8347 756.7831 770.1392 790.1909 809.5704 836.7961 858.5371 896.5462 903.3480 906.6034 923.8691 935.6407 960.3244 968.1733 988.6368 1016.3065 1019.1761 1027.3835 1050.4828 1078.0444 1101.0222 1121.9982 1149.0703 1150.3685 1173.9517 1209.1135 1219.4952 1234.9688 1243.4974 1269.2882 1285.2644 1298.8110 1305.2763 1313.0115 1317.3220 1352.5088 1401.4770 1451.0313 1451.7413 1471.7657 1481.5332 1560.9370 1654.3926 1686.1975 2952.5272 2965.8964 2994.1380 2997.3594 3032.2015 3040.5239 3062.0333 3075.1950 3135.9696 3141.7386 3158.7767 3165.2591 3193.9182 3514.0196
redmass: 4.4298 8.6399 2.9696 2.9684 3.7448 4.7141 3.6546 1.6880 5.0313 4.0658 3.3030 4.3352 3.6468 2.8564 2.2798 3.1785 1.2239 2.5293 3.5703 3.2050 2.5962 4.6661 3.9152 1.9844 1.9987 2.2356 1.9572 4.0994 2.1653 1.6447 1.9662 1.6246 1.9524 2.1868 1.7603 1.5212 2.6263 1.3849 1.7269 1.2740 1.2785 1.3430 1.7204 1.5751 1.6712 1.4286 1.4619 1.5639 1.6443 1.3119 1.3768 1.7582 1.7574 1.8740 1.9989 2.0557 2.1030 1.0840 1.0801 1.0849 1.0997 6.1800 8.1936 10.5695 1.0668 1.0654 1.0637 1.0642 1.0929 1.0948 1.0997 1.1051 1.0898 1.0894 1.0916 1.0894 1.1066 1.0639
irintensity: 0.1728 1.7163 0.6899 0.1001 0.0230 0.9799 1.7947 0.2430 3.7662 5.2878 1.1739 19.5417 10.1475 1.5428 2.7794 20.1491 129.6854 24.5662 1.6735 17.8072 16.8442 2.1475 11.4769 25.8970 9.4044 0.4916 4.3922 22.2604 1.8655 0.7510 6.9622 11.1186 11.2366 6.9813 6.7222 0.2547 419.6066 42.5509 7.9740 0.4033 22.6769 0.0712 10.3535 10.7367 6.3824 2.5956 6.6788 1.0340 2.2436 0.6395 1.2683 6.0094 3.7574 14.7396 2.6984 13.1990 133.2806 5.5754 10.2083 9.7545 5.5701 6.3936 135.4314 27.4502 23.9602 13.8596 41.5368 34.6959 31.5694 19.2366 49.4800 63.8690 4.4179 6.6358 13.7022 6.8881 15.0260 26.3926
temp: 298.150 k
press: 1.00000 atm
elementType: 8 8 6 6 6 6 6 6 6 6 6 6 6 6 1 1 1 1 1 1 1 1 1 1 1 1 1 1
symmnumber: 1
zpe: 602339.1 jmol-1
zpe.correction: 0.229419 hartree
zpe.thermalcorrener: 0.242028 hartree
zpe.thermalcorrenthalpy: 0.242972 hartree
zpe.thermalcorrgfe: 0.189561 hartree
zpe.sumelectzpe: -615.038704 hartree
zpe.sumelectthermal: -615.026095 hartree
zpe.sumelectthermalent: -615.025151 hartree
zpe.sumelectthermalfe: -615.078562 hartree
dipole: -0.8901 0.0590 1.3141
dipole: 1.5883
quadrupole: -77.3800 -80.1717 -80.0770
quadrupole: 1.2554 0.6615 0.1265
quadrupole: 1.8296 -0.9622 -0.8674 1.2554 0.6615 0.1265
hfenergy: -615.2681228 hartree
pointgroup: C01 [X(C12H14O2)]
dipole: -0.3454481 -0.0415712 -0.5190351 debye
polarizability: 183.1109565|-5.9225694|118.2033125|-5.9090467|-4.5336436|107.9986327 unknown
InChI: InChI=1S/C12H14O2/c13-12(14)11-9-6-5-8(10(9)11)7-3-1-2-4-7/h5-6,9-11,13H,1-4H2
charge 0 multiplicity 1
28 atoms
O  3.245416 2.0483 0.330626
O  1.600131 0.95815 1.562022
C  0.769838 -0.440733 -1.190828
C  2.01927 -1.264144 -0.857047
C  2.073021 0.314716 -0.778937
C  -0.250696 -0.792475 -0.134998
C  1.671831 -2.035661 0.378886
C  -1.52115 -0.291564 -0.055564
C  0.386388 -1.760676 0.774157
C  2.224222 1.074645 0.481314
C  -2.122766 0.739985 -1.009137
C  -2.555775 -0.65265 1.008589
C  -3.453513 1.172955 -0.332388
C  -3.893373 -0.091472 0.452475
H  0.44157 -0.26814 -2.219893
H  2.668939 -1.700007 -1.621185
H  2.623068 0.766744 -1.60919
H  2.378393 -2.689543 0.895327
H  -0.092433 -2.146301 1.677895
H  -1.438828 1.58803 -1.198102
H  -2.33063 0.272492 -1.995496
H  -2.594175 -1.736449 1.221788
H  -2.301333 -0.145223 1.962382
H  -3.261704 2.002522 0.374723
H  -4.210909 1.517888 -1.058143
H  -4.352157 -0.823642 -0.239941
H  -4.628764 0.127215 1.246678
H  3.326822 2.544042 1.190387
