program: Gaussian 09
title: 000179191
version: EM64L-G09RevD.01
frameworkgroup: C1[X(C19H23NO2)]
method: RPBEPBE
basis: SDD
operation: Freq
keyword: #p
keyword: freq=noraman
keyword: PBEPBE/SDD
title: #p freq=noraman PBEPBE/SDD
converged: YES YES NO NO
title: Mulliken charges:
elementType: O O N C C C C C C C C C C C C C C C C C C C H H H H H H H H H H H H H H H H H H H H H H H
charge: -0.278237 -0.310918 -0.374418 0.309559 -0.418466 -0.710143 -0.697376 -0.727043 0.218773 -0.653772 0.448206 -0.544471 -0.416745 0.347457 -0.194858 -0.403184 0.348020 -0.354480 -0.384610 -0.205938 -0.193345 -0.249029 0.211761 0.253034 0.205582 0.218105 0.214366 0.205385 0.224703 0.213428 0.219512 0.207501 0.214008 0.331271 0.251817 0.248236 0.278519 0.245478 0.232417 0.260535 0.258038 0.258313 0.229695 0.231380 0.231939
chargesum: 0.00000
title: Mulliken charges with hydrogens summed into heavy atoms:
elementType: O O N C C C C C C C C C C C C C C C C C C C
charge: -0.278237 -0.310918 -0.043147 0.309559 0.046329 -0.072090 -0.053861 -0.086023 0.218773 -0.153718 0.448206 -0.265952 -0.171268 0.347457 0.037559 -0.142649 0.348020 -0.096442 -0.126297 0.023757 0.038034 -0.017090
polarizability: 2.67839800e+02 -1.86090755e+01 2.18155389e+02 -1.68472865e-01 -1.63067490e+01 1.71455408e+02
1716.lowfreq: -19.9147 -8.3967 -5.3171 -0.0001 0.0005 0.0008 5.5941 12.0791 24.6516
frequency: -12.6334 6.5370 24.6110 31.6214 44.3248 46.5961 53.9097 80.6412 89.4309 172.8491 198.3548 207.6276 216.5649 230.0734 235.7617 251.3968 264.9154 282.4074 305.3001 316.9855 326.7029 361.0858 379.9617 395.6963 406.1243 410.3774 442.6140 474.4112 483.5624 532.8634 562.1533 567.9580 600.5470 604.2225 615.7729 622.5081 663.4819 692.3685 695.2184 730.1741 735.5435 763.2966 802.4049 816.0024 833.8519 838.0260 891.2443 897.6687 902.2995 906.7649 913.8031 926.9129 929.0477 942.4109 948.8059 963.2519 968.5196 977.6557 986.1479 987.1577 988.6677 1019.3863 1021.0780 1049.5374 1076.9055 1081.3210 1083.2156 1139.9844 1167.2864 1170.3831 1173.0080 1174.9119 1196.7147 1202.3187 1214.7956 1222.5503 1245.5138 1254.8996 1286.6526 1300.5268 1302.8930 1309.7898 1346.0365 1371.0803 1375.3557 1379.2667 1386.9377 1401.5716 1429.8419 1442.1979 1448.8836 1450.5117 1456.7687 1463.7719 1465.9774 1469.8809 1478.1111 1479.6385 1484.4876 1492.5246 1499.2251 1590.7596 1594.0475 1603.6845 1610.9793 1618.2830 2962.2549 2967.5264 2972.6233 2977.5438 3009.7313 3053.3091 3059.8487 3062.0676 3064.4193 3066.1052 3068.6754 3073.7189 3079.0144 3127.5412 3132.0815 3141.1105 3147.5345 3150.4748 3156.6625 3165.3187 3173.9136 3175.4870 3530.6415
redmass: 3.8949 4.6813 5.7863 3.9272 4.5435 3.4474 3.6401 4.1492 3.6201 1.1743 3.6066 3.1652 4.3726 1.7667 1.1091 2.0699 1.9080 3.9704 5.4413 3.6790 2.1582 2.8131 3.3981 2.4801 2.1462 2.9109 3.0063 3.0755 2.9783 3.8910 7.4831 3.9528 5.2968 4.9048 4.0739 1.3789 3.9922 2.3263 2.9431 2.8216 3.4785 1.6414 1.8184 3.6442 1.4593 2.2799 1.6801 1.7293 1.4715 2.0124 1.5458 1.8067 1.5440 1.2303 1.7295 2.7708 1.3643 1.3267 5.9815 5.1338 1.3676 2.0827 1.4748 1.5436 1.5110 1.6057 4.7651 1.9017 1.1908 1.1190 1.1662 1.1111 2.2965 1.6389 2.4033 2.6678 2.9567 2.9935 1.7171 1.3337 1.6176 1.3073 1.3280 1.2133 1.2052 7.5486 9.1178 1.2127 2.7064 2.2937 1.1263 1.1007 1.0503 1.0515 1.0683 2.2464 2.5108 1.1006 1.0605 1.2974 1.3110 6.4223 6.3564 6.6905 6.5377 7.5106 1.0355 1.0369 1.0553 1.0422 1.0609 1.0996 1.0984 1.0990 1.1001 1.0992 1.0997 1.0983 1.0991 1.0877 1.0851 1.0890 1.0919 1.0930 1.0929 1.0964 1.0973 1.1005 1.0770
irintensity: 1.4760 0.4738 0.4165 1.4839 6.9882 1.3336 0.1181 0.8900 1.2173 0.1957 1.2789 3.2152 0.6869 2.6525 0.5064 0.2765 3.0263 1.0944 0.8213 1.0910 0.5861 3.6797 4.4444 3.0603 3.4150 0.6865 5.8300 11.3678 15.8237 27.7121 0.5446 5.7714 3.4827 1.0067 9.3664 39.7901 5.2584 28.9598 29.5786 6.0156 6.3165 93.3883 36.8730 15.6478 2.7950 10.7295 0.5737 22.0995 4.8521 3.9398 7.8989 2.0352 2.4428 0.3068 7.6298 41.7690 0.1098 0.9787 0.9609 0.2477 0.6227 13.5623 0.8608 2.8627 11.2174 6.8973 1.0823 7.3247 52.7297 1.8734 30.1454 1.5340 156.4764 12.3375 84.9076 60.3090 196.5170 10.7770 23.5514 5.8972 26.2533 0.6958 9.4982 21.8631 21.9827 4.7118 0.3810 15.2398 49.6033 7.3474 44.7119 10.1983 0.3874 2.5467 9.0057 181.1892 28.4990 15.1999 12.7996 122.4043 81.4621 162.4058 35.8461 122.7262 5.8513 190.8702 34.0708 19.9927 68.2488 9.5458 11.8142 28.7994 8.8878 13.0619 4.0019 35.1109 18.4766 93.4827 44.0639 6.5795 2.1540 8.6833 18.8022 5.2365 26.3387 14.8121 7.1070 7.0945 33.6738
temp: 298.150 k
press: 1.00000 atm
elementType: 8 8 7 6 6 6 6 6 6 6 6 6 6 6 6 6 6 6 6 6 6 6 1 1 1 1 1 1 1 1 1 1 1 1 1 1 1 1 1 1 1 1 1 1 1
symmnumber: 1
zpe: 980329.5 jmol-1
zpe.correction: 0.373388 hartree
zpe.thermalcorrener: 0.394532 hartree
zpe.thermalcorrenthalpy: 0.395476 hartree
zpe.thermalcorrgfe: 0.320162 hartree
zpe.sumelectzpe: -941.413495 hartree
zpe.sumelectthermal: -941.392351 hartree
zpe.sumelectthermalent: -941.391407 hartree
zpe.sumelectthermalfe: -941.466721 hartree
dipole: 0.9750 0.0518 -3.0520
dipole: 3.2043
quadrupole: -127.1222 -123.8622 -143.1905
quadrupole: -8.1507 15.2727 2.2413
quadrupole: 4.2695 7.5294 -11.7989 -8.1507 15.2727 2.2413
hfenergy: -941.7868832 hartree
pointgroup: C01 [X(C19H23N1O2)]
dipole: -0.4760164 -0.6951147 0.9378309 debye
polarizability: 246.2527517|25.1164247|207.9026886|15.1029541|38.9911976|203.2951572 unknown
InChI: InChI=1S/C19H23NO2/c1-19(2,3)14-20-18(21)13-15-8-7-11-17(12-15)22-16-9-5-4-6-10-16/h4-12,20H,13-14H2,1-3H3
charge 0 multiplicity 1
45 atoms
O  3.002159 1.338622 -2.094416
O  -3.430623 -0.649445 0.013565
N  2.182964 0.213009 -0.222955
C  4.182291 -0.115354 1.325571
C  3.410473 -0.552142 0.039834
C  5.432809 -1.025696 1.44214
C  4.619324 1.365817 1.204749
C  3.288185 -0.303088 2.579942
C  2.06869 1.110647 -1.266287
C  0.710937 1.849716 -1.39269
C  -0.357894 1.502168 -0.371256
C  -1.36285 0.551333 -0.683171
C  -0.362367 2.115128 0.910575
C  -2.346756 0.221532 0.277634
C  -1.356987 1.782441 1.858713
C  -2.353791 0.832353 1.551746
C  -3.324789 -1.700166 -0.936652
C  -2.171889 -2.511462 -1.051761
C  -4.48459 -1.96823 -1.695222
C  -2.185793 -3.596199 -1.956518
C  -4.485642 -3.059921 -2.591286
C  -3.337241 -3.874474 -2.730001
H  3.154991 -1.62815 0.123426
H  4.057612 -0.417133 -0.845242
H  5.148378 -2.092354 1.526343
H  6.089775 -0.915014 0.55899
H  6.024213 -0.762649 2.338638
H  5.178542 1.68161 2.10542
H  5.266134 1.518098 0.321666
H  3.742954 2.030578 1.095299
H  3.853171 -0.058822 3.498608
H  2.936184 -1.349261 2.669977
H  2.402123 0.360085 2.553644
H  1.382571 0.100947 0.403035
H  0.358134 1.652177 -2.421043
H  0.956313 2.92731 -1.354889
H  -1.384336 0.087258 -1.674873
H  0.40094 2.862815 1.155672
H  -1.359449 2.266951 2.841141
H  -3.136949 0.564282 2.266686
H  -1.287382 -2.308314 -0.439947
H  -5.361184 -1.325632 -1.570588
H  -1.296008 -4.228615 -2.049316
H  -5.383473 -3.270895 -3.182377
H  -3.340676 -4.717859 -3.42832
