program: Gaussian 09
title: 000179139
version: EM64L-G09RevD.01
frameworkgroup: C1[X(C10H14O2)]
method: RPBEPBE
basis: SDD
operation: Freq
keyword: #pfreq=noraman
keyword: PBEPBE/SDD
title: #p freq=noraman PBEPBE/SDD
converged: YES YES NO NO
title: Mulliken charges:
elementType: O O C C C C C C C C C C H H H H H H H H H H H H H H
charge: -0.426663 -0.269398 0.324843 -0.250853 -0.314756 -0.481897 -0.522112 -0.777664 0.158548 0.433045 -0.422179 -0.820647 0.270409 0.284853 0.214536 0.219561 0.220958 0.211280 0.213348 0.264949 0.211042 0.212846 0.220028 0.223673 0.228023 0.374229
chargesum: 0.00000
title: Mulliken charges with hydrogens summed into heavy atoms:
elementType: O O C C C C C C C C C C
charge: -0.052435 -0.269398 0.324843 0.019556 -0.029903 -0.047801 -0.089875 -0.088325 0.158548 0.433045 -0.209333 -0.148923
polarizability: 1.25085354e+02 1.82194723e+00 1.06596072e+02 -1.56695511e+00 -4.62482521e+00 9.70098945e+01
1716.lowfreq: -17.1878 -7.6256 0.0002 0.0006 0.0007 10.8444 59.9477 73.5938 124.3533
frequency: 59.9246 73.5792 124.3304 161.0325 174.8690 197.7913 220.6462 250.7462 258.5951 299.0003 343.0132 377.0057 412.8363 432.1339 458.6739 550.9245 576.0771 614.0895 643.1488 692.3161 705.0260 772.4895 785.7229 831.7092 896.9313 905.1326 946.1286 959.6841 986.4279 995.6758 1012.7202 1057.9274 1061.5229 1069.9803 1082.5186 1090.6863 1096.4626 1173.2168 1191.2202 1207.6222 1217.1830 1242.9373 1288.2287 1292.9806 1332.6712 1363.4779 1371.8040 1397.1544 1397.8513 1434.7000 1454.0466 1458.4504 1462.3482 1472.8175 1480.1157 1486.7572 1642.6397 1699.5154 2943.3065 2947.4920 2958.7890 2973.5025 2989.4565 2990.4561 3028.2652 3055.8926 3080.4733 3093.6284 3102.9174 3112.5801 3156.2103 3511.9489
redmass: 4.6926 4.2007 3.6202 2.5047 1.3653 1.5983 1.4162 2.3290 3.2725 2.6387 2.8832 2.3857 4.1993 2.2882 3.5636 4.6274 1.8353 3.8841 2.0762 3.6743 4.1660 4.9083 1.4903 2.2042 2.1292 1.9852 1.7181 3.1821 2.1284 1.4981 1.4405 1.7073 1.3433 1.8836 1.6243 2.7884 1.3982 1.8959 1.4965 1.2781 1.3010 1.6407 2.0459 1.6317 1.6375 2.4615 1.8819 1.2450 1.2437 2.1306 1.0764 1.1364 1.0522 1.0664 1.2281 1.0491 7.7047 6.5537 1.0627 1.0600 1.0387 1.0373 1.0964 1.0969 1.0967 1.0987 1.0978 1.0984 1.0905 1.0892 1.0891 1.0638
irintensity: 0.9945 1.2014 0.7841 1.2772 0.7759 0.3514 0.4196 1.0864 4.5279 1.0341 1.4792 1.5506 14.2494 7.6917 9.3213 11.0091 60.7389 21.0190 70.6217 0.9779 15.4157 6.4620 17.8600 20.1937 1.4758 2.0458 2.3928 25.7876 22.6868 12.2336 20.6452 21.1939 23.5279 300.9142 15.0940 7.8987 7.4904 3.0926 6.9694 31.5687 3.0842 5.8102 7.1805 1.8008 30.5862 28.7904 28.2759 14.8735 17.8023 70.0301 8.8148 9.0519 14.9123 14.3111 14.3117 10.3711 232.5103 1.2174 39.5675 33.4926 58.5030 45.4818 22.4887 26.6051 26.5436 30.9426 25.2660 5.3689 40.6217 6.0033 1.2410 26.4478
temp: 298.150 k
press: 1.00000 atm
elementType: 8 8 6 6 6 6 6 6 6 6 6 6 1 1 1 1 1 1 1 1 1 1 1 1 1 1
symmnumber: 1
zpe: 569363.5 jmol-1
zpe.correction: 0.216859 hartree
zpe.thermalcorrener: 0.228998 hartree
zpe.thermalcorrenthalpy: 0.229942 hartree
zpe.thermalcorrgfe: 0.179092 hartree
zpe.sumelectzpe: -538.968930 hartree
zpe.sumelectthermal: -538.956791 hartree
zpe.sumelectthermalent: -538.955847 hartree
zpe.sumelectthermalfe: -539.006697 hartree
dipole: -1.9340 0.1878 -0.4951
dipole: 2.0051
quadrupole: -71.6797 -69.1541 -72.7180
quadrupole: -1.0113 -5.0186 -1.3776
quadrupole: -0.4958 2.0298 -1.5341 -1.0113 -5.0186 -1.3776
hfenergy: -539.1857891 hartree
pointgroup: C01 [X(C10H14O2)]
dipole: 0.7639255 0.1333141 0.1448583 debye
dipolederiv: -0.4898428 -0.072802 0.4419755 -0.0515155 -0.4307257 0.1622194 0.486136 0.2218521 -1.1484117 -0.9356886 -0.1426487 -0.2201465 -0.1360486 -0.377681 -0.0230367 -0.1713488 0.008805 -0.7813581 0.2920346 0.1057792 -0.061052 0.0367357 0.0869059 -0.0038349 -0.3118239 -0.203175 0.2917776 0.1449209 0.0256372 -0.0282847 0.2074983 0.0678085 -0.1330791 -0.2142907 -0.0532274 0.1103691 -0.8247941 -0.2606181 0.3067967 -0.3135453 -0.2173175 0.1441097 0.4538042 0.177622 -0.2643666 0.0298804 0.0271967 -0.1217206 0.070624 0.0315877 0.0239495 -0.0611526 0.0903132 0.1177072 0.0049896 0.0266948 -0.0927814 -0.0069989 0.1115457 -0.0339387 -0.0541139 -0.0605757 0.0411059 -0.101268 -0.052893 -0.0546916 -0.0486469 0.0383732 0.0239464 -0.0447425 0.0473329 0.0114852 1.6958124 0.4541947 -0.3173835 0.3566738 0.2843641 -0.1539603 -0.214683 -0.1803025 1.4643965 0.1330743 -0.0826505 0.1382056 -0.0380696 0.1278984 0.0690729 0.1840354 0.1229398 0.0195571 -0.0211128 -0.0536894 0.1443046 -0.0803738 -0.0357573 0.0527425 0.1971644 -0.0207372 -0.1524889 -0.0500176 0.0447941 -0.066545 0.0803821 0.0104041 0.0221881 -0.0730279 -0.0001577 0.0656767 -0.0390532 -0.0246307 -0.0860836 -0.0034853 0.0694793 -0.0486439 -0.0254796 -0.0562733 -0.007178 0.0476096 -0.0067532 -0.0498181 0.0216201 0.0853433 0.0213793 -0.0290359 0.028842 -0.0112724 -0.0020248 0.0885609 0.0483865 0.037576 -0.0305926 -0.08315 0.0260049 -0.144382 -0.0491468 -0.0210676 -0.0165312 0.0412226 -0.0402839 -0.0724175 0.0931895 0.0102128 0.16258 -0.0193337 -0.0425935 -0.0023967 0.091394 0.007759 0.0643909 -0.0119898 0.0722088 -0.0755641 -0.1147175 0.029645 -0.0006751 -0.0123204 0.0298154 -0.1816882 0.0237278 -0.0202533 0.0966003 0.0622046 0.035916 -0.0417263 0.1191497 -0.0242323 0.0137215 0.0938721 0.0828468 0.1070139 -0.0755342 -0.016382 -0.0091049 -0.0667867 -0.0733944 0.078049 -0.0700291 -0.0550099 -0.0306256 0.0992072 0.0699791 0.0752839 0.012589 0.0905683 -0.0974346 -0.0547083 0.0486516 -0.1196498 0.0045478 -0.0719986 -0.0370742 -0.1343092 -0.0306671 0.041602 -0.0629653 -0.1538798 -0.0785339 0.038822 -0.0103939 0.0935211 0.0584261 0.0747731 0.0515636 -0.0501525 0.1300271 -0.0793503 -0.0646814 0.0420477 -0.0546486 0.0462073 0.0037343 -0.1026103 0.1079591 -0.0101976 0.1213037 0.0390041 -0.0261818 -0.0284299 -0.0775434 -0.1161016 0.0106591 -0.1016068 -0.1267506 -0.053582 0.0149392 0.1265098 -0.0543898 -0.0591907 -0.054397 0.3725284 -0.0072609 -0.1253018 -0.0290682 0.3076891 unknown
polarizability: 124.9373627|-2.8301598|108.4817092|-0.2997145|-1.3581697|95.2722492 unknown
InChI: InChI=1S/C10H14O2/c1-6-3-4-10(2)7(5-6)8(10)9(11)12/h3,7-8,11H,4-5H2,1-2H3
charge 0 multiplicity 1
26 atoms
O  -2.670831 -0.731842 1.77331
O  -3.026748 -0.635866 -0.5191
C  -0.253213 0.971743 -0.512629
C  0.000855 -0.478549 -0.888431
C  -0.797795 -0.18453 0.408958
C  0.914026 1.764848 0.095202
C  1.391953 -1.09443 -0.777317
C  -1.225547 1.811111 -1.332509
C  -2.232401 -0.522253 0.450296
C  2.330882 -0.357099 0.168983
C  2.092829 0.926582 0.553826
C  3.548672 -1.130898 0.633337
H  -0.625071 -0.869568 -1.700575
H  -0.27226 -0.307047 1.359671
H  0.540611 2.381984 0.938382
H  1.263742 2.491381 -0.670824
H  1.849833 -1.116065 -1.789947
H  1.309687 -2.156394 -0.464834
H  -0.713461 2.208234 -2.22959
H  -2.096759 1.222392 -1.66425
H  -1.594904 2.673422 -0.745348
H  2.808186 1.421277 1.226116
H  4.143333 -1.494282 -0.228689
H  3.254468 -2.028547 1.213217
H  4.209624 -0.51483 1.26742
H  -3.638712 -0.965278 1.748821
