program: Gaussian 09
title: 000179178
version: EM64L-G09RevD.01
frameworkgroup: C1[X(C24H22N2O3)]
method: RPBEPBE
basis: SDD
operation: Freq
keyword: #p
keyword: freq=noraman
keyword: PBEPBE/SDD
title: #p freq=noraman PBEPBE/SDD
converged: YES YES NO NO
title: Mulliken charges:
elementType: O O O N N C C C C C C C C C C C C C C C C C C C C C C C C H H H H H H H H H H H H H H H H H H H H H H
charge: -0.308453 -0.279637 -0.312104 -0.430068 0.000462 0.166372 0.492088 -0.744377 -0.741061 -0.397317 -0.385437 0.307277 -0.239957 -0.242999 -0.242183 -0.186210 0.539083 -0.525048 -0.441975 0.345749 -0.198245 -0.391965 -0.193234 0.348927 -0.355273 -0.386522 -0.201335 -0.193883 -0.248618 0.221448 0.243406 0.233055 0.208422 0.270558 0.223830 0.332981 0.232483 0.240143 0.223954 0.227293 0.290104 0.229480 0.288261 0.267580 0.233753 0.262490 0.266046 0.256713 0.232506 0.230041 0.231397
chargesum: 0.00000
title: Mulliken charges with hydrogens summed into heavy atoms:
elementType: O O O N N C C C C C C C C C C C C C C C C C C C C C C C C
charge: -0.308453 -0.279637 -0.312104 -0.097088 0.000462 0.166372 0.492088 -0.046468 -0.038251 -0.164834 -0.145294 0.307277 -0.016004 -0.015707 -0.012703 0.103894 0.539083 -0.236786 -0.174394 0.345749 0.035507 -0.129476 -0.193234 0.348927 -0.089227 -0.129808 0.031170 0.036157 -0.017220
polarizability: 3.39473443e+02 -3.12423538e+01 2.84479499e+02 4.79694858e+01 3.27318805e+00 2.11098883e+02
1716.lowfreq: -9.9231 -4.1207 -0.6868 -0.0006 -0.0004 0.0002 6.5776 9.2659 17.9470
frequency: 5.1820 8.0465 17.5765 24.3063 32.5364 38.1553 46.2738 54.8420 68.8112 86.9644 99.8936 131.8124 136.6364 176.5251 193.5147 215.4363 217.8976 243.8963 255.0856 259.7005 285.3903 288.5647 299.9196 316.9450 327.5076 339.1770 352.1777 377.4156 402.0230 407.0424 409.9169 424.9642 459.0370 478.7133 489.9398 532.6943 541.2673 553.0298 557.2064 562.7626 592.5448 610.5014 617.3024 628.5608 629.9847 682.8541 690.6291 695.7015 701.0463 704.4057 720.9425 739.5865 765.8285 771.8958 803.9728 823.2945 835.1841 850.2976 856.4468 890.4959 901.7489 909.2338 914.3266 918.6352 922.0470 932.1081 957.2289 968.9894 976.5412 984.5141 985.5677 986.8920 988.9674 989.3264 990.5976 995.0896 996.0629 1011.2782 1019.5119 1027.4240 1077.7128 1085.7051 1088.0720 1107.6761 1141.6278 1156.8365 1167.7629 1173.8272 1174.1051 1177.5265 1188.5004 1195.2576 1195.7394 1219.8472 1236.9267 1254.4924 1281.5014 1285.1524 1308.6736 1319.4370 1328.7208 1375.5836 1379.8234 1381.4182 1391.7900 1393.6721 1435.4184 1440.1039 1446.1702 1460.1858 1464.3355 1469.9042 1474.3796 1478.2189 1483.3861 1484.8218 1493.8271 1592.7999 1593.9494 1595.7225 1605.8121 1613.4451 1613.8603 1683.5798 2203.0770 2979.6736 2997.5384 2997.9740 3074.7296 3090.6735 3102.1917 3112.2291 3121.2406 3128.4878 3133.0844 3139.6833 3141.6588 3142.4957 3151.2243 3154.1509 3157.0539 3157.4851 3166.4877 3166.6136 3174.8320 3175.5930 3551.0265
redmass: 5.2937 6.4535 5.1546 4.1588 4.8760 5.5890 5.1549 5.2869 9.8539 6.0746 8.5852 4.0456 4.3021 5.7740 4.6111 2.0678 4.4998 4.1612 2.0735 3.1093 1.4675 1.9801 5.6541 3.7178 3.8330 5.1429 4.0398 5.3305 2.8088 3.4951 2.9439 6.1278 3.6131 3.4368 4.3374 4.8327 1.1748 3.4983 3.8679 6.9897 5.0010 6.2703 6.4062 6.3241 6.4103 6.5128 2.3537 4.5665 2.7215 1.9419 4.3547 3.7370 1.8626 1.9512 1.6419 3.6307 1.3338 1.2556 4.0125 2.7073 1.6693 2.2820 1.4328 1.5632 1.8169 1.4569 3.8471 1.3676 1.4069 2.9075 1.6547 3.8718 1.8904 2.3746 5.1146 3.2703 1.4810 1.3739 2.0935 2.4163 1.5097 1.6475 1.6071 2.0693 1.9738 2.4110 1.1609 1.1861 1.0563 1.1396 2.5899 1.3083 1.7546 3.4331 2.6645 3.3053 1.5695 1.2607 1.3486 1.3511 1.4518 1.2502 6.2748 8.0793 7.5545 1.2141 2.2118 2.3408 2.5363 1.2715 1.1070 2.2256 1.2364 2.5204 1.5259 1.2902 1.1334 6.0752 6.2838 6.5450 6.4437 6.4975 6.0824 9.8720 12.5972 1.0362 1.0397 1.0775 1.1005 1.0996 1.0985 1.1009 1.0849 1.0873 1.0850 1.0874 1.0928 1.0891 1.0921 1.0949 1.0935 1.0930 1.1005 1.0963 1.0984 1.1007 1.0774
irintensity: 0.0305 0.7343 0.2303 0.1295 0.2709 0.7617 0.3028 1.5444 8.7143 1.2317 0.6186 2.2563 0.1719 4.4350 2.9672 0.7185 2.3944 2.7834 2.3376 7.9761 0.3140 0.8669 0.8038 0.7647 5.9140 6.8660 1.9537 3.6653 0.1569 5.0754 0.4677 8.8366 7.4078 18.4297 3.3441 13.5038 85.4741 18.9214 8.5170 1.5933 1.3142 0.5581 0.0385 7.2856 2.1187 11.3350 51.4152 13.9257 19.4977 53.4637 0.8844 11.4116 112.6806 29.0492 59.1592 36.2041 5.3895 0.4365 66.0540 20.6888 25.7790 102.5254 5.7730 4.6991 36.8079 2.9653 10.5252 0.2170 9.3488 90.6456 67.6593 0.6632 62.7875 109.2260 5.8334 66.9993 9.1905 12.7683 11.7755 10.2216 11.9326 9.1095 4.7895 6.0163 4.7444 104.8825 32.4664 46.5303 0.7585 1.8360 4.2607 62.7747 74.4678 245.2071 193.4026 100.7657 57.3603 28.2544 1.2083 2.3502 13.4310 30.1796 6.0667 7.4243 7.5365 52.5392 13.4634 15.0659 89.1688 201.8617 35.1494 176.5821 114.0819 23.3278 47.7014 8.0321 9.9723 1.6394 32.7312 120.2404 40.8832 2.6114 5.2481 213.7799 1.7481 22.7006 30.5054 23.1316 29.4100 30.4605 31.6756 12.0710 4.5271 0.9110 1.7005 5.6931 25.5053 8.7275 6.1362 35.4727 0.2613 30.3232 17.1459 12.7785 9.8898 6.0797 34.9200
temp: 298.150 k
press: 1.00000 atm
elementType: 8 8 8 7 7 6 6 6 6 6 6 6 6 6 6 6 6 6 6 6 6 6 6 6 6 6 6 6 6 1 1 1 1 1 1 1 1 1 1 1 1 1 1 1 1 1 1 1 1 1 1
symmnumber: 1
zpe: 1049381.4 jmol-1
zpe.correction: 0.399688 hartree
zpe.thermalcorrener: 0.426358 hartree
zpe.thermalcorrenthalpy: 0.427302 hartree
zpe.thermalcorrgfe: 0.336597 hartree
zpe.sumelectzpe: -1260.865088 hartree
zpe.sumelectthermal: -1260.838418 hartree
zpe.sumelectthermalent: -1260.837474 hartree
zpe.sumelectthermalfe: -1260.928179 hartree
dipole: -1.7103 2.1223 2.6512
dipole: 3.8024
quadrupole: -152.1674 -166.3604 -162.1989
quadrupole: -4.2598 -1.5655 -3.3196
quadrupole: 8.0749 -6.1182 -1.9567 -4.2598 -1.5655 -3.3196
hfenergy: -1261.2647762 hartree
pointgroup: C01 [X(C24H22N2O3)]
dipole: 0.729584 0.5027429 -1.2053876 debye
polarizability: 323.7458075|52.2558325|283.3376986|45.5133495|-17.9423322|227.9683196 unknown
InChI: InChI=1S/C24H22N2O3/c1-24(2,19-11-5-3-6-12-19)26-23(27)29-22(17-25)18-10-9-15-21(16-18)28-20-13-7-4-8-14-20/h3-16,22,26H,1-2H3
charge 0 multiplicity 1
51 atoms
O  0.724331 -0.428531 0.073748
O  2.178512 1.196773 1.004611
O  -4.642079 0.712148 -1.220129
N  2.724862 -0.045435 -0.928291
N  -1.152071 -2.383306 2.141588
C  4.094805 0.493132 -1.189683
C  5.04984 0.10568 -0.032304
C  4.580878 -0.204526 -2.491386
C  4.004516 2.022607 -1.422645
C  6.087187 0.965973 0.403885
C  4.943046 -1.177016 0.565381
C  1.937025 0.336361 0.121232
C  6.991485 0.556994 1.410829
C  5.842631 -1.588286 1.571312
C  6.87566 -0.72202 1.998274
C  -0.258218 -0.075053 1.150928
C  -1.355755 0.825994 0.599536
C  -2.511354 0.28069 -0.007329
C  -1.17477 2.229088 0.670327
C  -3.488296 1.153872 -0.535238
C  -2.155734 3.085964 0.123222
C  -3.316694 2.556074 -0.477016
C  -0.751241 -1.355864 1.688903
C  -5.232214 -0.554554 -0.953261
C  -5.355147 -1.081656 0.353122
C  -5.793381 -1.217289 -2.065816
C  -6.037558 -2.30532 0.533929
C  -6.479851 -2.435465 -1.867754
C  -6.600273 -2.986966 -0.570434
H  3.922482 0.051184 -3.342863
H  5.603732 0.128558 -2.731959
H  4.606963 -1.302855 -2.369593
H  4.975151 2.42902 -1.754946
H  3.692102 2.541749 -0.502186
H  3.263399 2.228459 -2.214796
H  2.337756 -0.74588 -1.563278
H  6.191262 1.968027 -0.023602
H  4.136796 -1.852866 0.256551
H  7.781952 1.24144 1.739249
H  5.735237 -2.580093 2.024813
H  0.309623 0.463032 1.936837
H  7.574215 -1.037057 2.781354
H  -2.643153 -0.804349 -0.071454
H  -0.271489 2.637496 1.136304
H  -2.021617 4.171525 0.172794
H  -4.092229 3.201217 -0.900203
H  -4.936176 -0.548449 1.212042
H  -5.687743 -0.771535 -3.059366
H  -6.130769 -2.721306 1.542898
H  -6.916553 -2.954151 -2.728186
H  -7.127782 -3.934829 -0.421146
