program: Gaussian 09
title: 000179125
version: EM64L-G09RevD.01
frameworkgroup: C1[X(C10H13ClO)]
method: RPBEPBE
basis: SDD
operation: Freq
keyword: #p
keyword: freq=noraman
keyword: PBEPBE/SDD
title: #p freq=noraman PBEPBE/SDD
converged: YES YES NO NO
title: Mulliken charges:
elementType: Cl O C C C C C C C C C C H H H H H H H H H H H H H
charge: -0.027295 -0.136745 0.221850 -0.181084 -0.524213 -0.485590 0.150022 -0.398100 -0.534610 -0.753254 0.466388 -0.825443 0.243127 0.305397 0.215549 0.222651 0.209311 0.243245 0.227837 0.218586 0.228247 0.233538 0.231149 0.220700 0.228737
chargesum: 0.00000
title: Mulliken charges with hydrogens summed into heavy atoms:
elementType: Cl O C C C C C C C C C C
charge: -0.027295 -0.136745 0.221850 0.062044 -0.218816 -0.047390 0.150022 -0.170263 -0.082054 -0.072884 0.466388 -0.144856
polarizability: 1.15821222e+02 1.90940244e+00 1.18441381e+02 6.86538755e+00 -1.93978769e+00 9.99027824e+01
1716.lowfreq: -11.2412 -0.0023 0.0008 0.0015 3.1154 13.4315 41.4262 81.7391 118.5563
frequency: 41.3763 81.7235 118.5557 160.9656 174.5719 190.0716 213.4130 230.3423 249.5589 272.0093 314.3827 375.4600 420.7167 432.8855 454.4222 536.1201 588.2489 623.4562 675.7211 703.5368 740.1638 783.3890 828.0093 854.6242 895.6170 908.7824 942.0401 979.6953 994.8428 998.4607 1039.3082 1043.9322 1066.9645 1099.7695 1126.3282 1132.3475 1172.4710 1191.4796 1197.7388 1216.5068 1239.0953 1264.6999 1308.6324 1323.1914 1334.9727 1371.6129 1384.5757 1396.7513 1450.4265 1459.2567 1466.5146 1470.3066 1471.2422 1473.8666 1691.0166 1716.8052 2960.9890 2967.9138 2975.6942 2981.5529 3019.9697 3023.1390 3033.1913 3045.3280 3051.3359 3072.3239 3079.4971 3083.6549 3115.5615
redmass: 5.4448 4.5333 3.7005 8.0793 1.3608 1.5051 1.2362 3.2988 2.6605 2.7846 2.9549 4.9607 3.9773 2.3728 3.5261 3.7197 3.2541 3.4982 5.3666 5.0911 2.4844 2.8692 1.7362 2.9903 2.1217 2.5629 1.9527 1.5345 2.3212 1.8547 1.4421 1.8855 2.2115 2.3563 1.4079 1.8378 1.8296 1.3210 2.1509 1.5201 1.8533 1.6485 1.4737 1.3399 1.6519 1.7843 1.2159 1.2381 1.0852 1.0535 1.0699 1.0581 1.0645 1.0576 6.7168 12.4104 1.0398 1.0603 1.0354 1.0616 1.0948 1.0860 1.0965 1.1022 1.0866 1.0995 1.0998 1.0981 1.0909
irintensity: 0.8275 1.8142 1.8431 0.6527 0.6054 0.0859 0.4062 0.7895 1.4535 1.1073 1.1282 0.5121 4.8007 6.0740 1.4964 2.0650 2.9087 0.7762 19.0523 0.4609 26.5820 6.9335 6.5852 25.2866 4.1296 16.8775 2.3200 0.8766 5.8006 15.1867 11.8259 5.2585 7.1159 0.6696 1.2490 1.8542 1.9005 2.1003 4.1364 3.6416 4.5702 7.8568 2.8904 1.8984 1.8773 7.4751 5.8397 13.3756 6.8945 18.4423 2.1727 1.7509 26.0879 15.7354 4.4370 169.7923 23.7500 39.6164 22.3420 36.3967 38.1147 18.2796 24.4568 21.0528 14.9649 29.1384 22.9201 26.4375 20.4161
temp: 298.150 k
press: 1.00000 atm
elementType: 17 8 6 6 6 6 6 6 6 6 6 6 1 1 1 1 1 1 1 1 1 1 1 1 1
symmnumber: 1
zpe: 534151.3 jmol-1
zpe.correction: 0.203447 hartree
zpe.thermalcorrener: 0.215648 hartree
zpe.thermalcorrenthalpy: 0.216592 hartree
zpe.thermalcorrgfe: 0.165036 hartree
zpe.sumelectzpe: -923.200022 hartree
zpe.sumelectthermal: -923.187821 hartree
zpe.sumelectthermalent: -923.186877 hartree
zpe.sumelectthermalfe: -923.238433 hartree
dipole: 1.6485 -2.3875 -2.8239
dipole: 4.0488
quadrupole: -76.0672 -79.5954 -81.8359
quadrupole: 2.5304 8.0931 0.0780
quadrupole: 3.0990 -0.4292 -2.6697 2.5304 8.0931 0.0780
hfenergy: -923.4034693 hartree
pointgroup: C01 [X(C10H13Cl1O1)]
dipole: -0.4585323 1.0800241 -1.0773284 debye
dipolederiv: -0.1638044 -0.1306112 0.0083574 -0.0355415 -0.6443339 0.0534565 0.0102776 0.132592 -0.1597567 -0.400648 0.041564 -0.2178333 0.0318293 -0.401261 0.0319859 -0.4053192 -0.0192483 -0.8226148 0.0135422 0.2200309 -0.0561121 0.0588536 -0.2997831 0.171679 -0.0271205 0.0933208 -0.0788524 0.0038912 -0.1448922 -0.0361659 0.0251955 -0.1105242 -0.0728185 -0.0539576 -0.0558184 0.1885524 0.1551052 0.1163729 -0.0974945 0.0781659 0.5494373 -0.2162437 -0.0998814 -0.4038021 -0.0278491 0.0693114 -0.0799376 0.0593261 -0.033928 0.0863966 -0.0227007 0.0015844 0.0578215 0.0519593 0.2458408 -0.1529902 0.3641876 -0.1076075 0.7472162 -0.05554 0.5792129 0.2057926 0.8942044 0.0385913 0.0196229 0.0515617 0.0551588 -0.1116778 0.1504651 0.061453 0.0730125 -0.2141187 -0.0292137 -0.1073964 -0.0034368 -0.1201335 0.1025112 -0.0153708 0.0013751 -0.0689233 0.0257601 0.0072522 0.0562154 -0.0244808 -0.011431 0.1079319 -0.0045955 -0.0014145 -0.0129131 0.0600546 0.2330773 0.0927034 -0.060349 0.0752676 -0.0055447 0.1172287 -0.1066429 0.1788022 0.1491795 -0.114923 -0.0614384 0.0215059 -0.0280911 0.0573069 -0.0216781 0.0688842 -0.0340338 0.0507747 -0.0075298 0.0170924 0.064285 -0.0042318 0.0323667 0.0249641 0.0473051 0.0141079 -0.1441075 -0.0711735 0.0046792 0.080435 -0.011778 0.0156009 0.0112843 0.0452293 0.0086856 0.0513156 0.0248486 0.0862256 -0.0258763 0.0465921 -0.0611157 0.0834324 -0.0127175 0.1156399 -0.0330689 -0.0096195 -0.0859947 -0.0747895 -0.0599283 -0.0217494 -0.0702222 -0.0569822 -0.1195554 -0.0114201 -0.0841024 0.1139152 0.0828216 0.0984828 -0.0334643 -0.0835226 0.0616077 -0.0415893 0.0555734 0.0713301 -0.0134412 -0.0819652 0.003542 0.0014577 0.0702975 -0.0192786 0.0434129 -0.0690983 -0.033071 -0.0753834 -0.0468319 -0.0925374 0.0291595 -0.1129105 -0.0342749 -0.0986137 0.0424154 -0.0236048 0.0544729 0.0752304 0.1172615 -0.0027678 -0.088176 0.0958489 -0.0416093 0.0305257 0.0339667 0.058484 -0.0755519 0.0270736 -0.017729 0.1080145 -0.0393853 0.1137875 -0.0184614 0.0236994 -0.0840395 -0.0314395 -0.1053294 -0.0105249 -0.0453601 -0.0848429 -0.1028154 -0.0028036 0.0368284 -0.0371858 -0.0109057 -0.1004976 -0.0155357 -0.0983519 -0.0930314 -0.1229858 -0.0080604 -0.055101 0.0814833 0.0218572 0.1451871 -0.0778363 0.0091358 -0.0084828 0.007956 0.1045637 0.0355061 0.0104484 0.0136648 -0.0515746 0.0844628 0.0755468 0.0705534 0.0769764 -0.1146669 unknown
polarizability: 116.1030794|2.5725814|117.2955223|-7.1291021|3.5757922|100.7667839 unknown
InChI: InChI=1S/C10H13ClO/c1-6-3-4-10(2)7(5-6)8(11)9(10)12/h5,7-8H,3-4H2,1-2H3
charge 0 multiplicity 1
25 atoms
Cl 0.544185 -2.935463 0.053596
O  1.922633 -0.245099 1.714978
C  0.849789 0.903625 -0.32807
C  0.202653 -0.247457 -1.211408
C  1.188946 -1.283483 -0.520477
C  -0.14957 1.827953 0.396925
C  1.480537 -0.213161 0.556327
C  -1.265985 -0.489295 -0.959003
C  -1.341153 1.066523 1.019455
C  1.929185 1.719245 -1.078648
C  -1.981902 0.082512 0.048608
C  -3.43928 -0.253215 0.288743
H  0.40623 -0.157462 -2.29328
H  2.075183 -1.512675 -1.137566
H  -0.531011 2.561492 -0.341051
H  0.391208 2.394232 1.179211
H  -2.100421 1.793831 1.36756
H  -1.007924 0.520174 1.926429
H  -1.75539 -1.2127 -1.623927
H  2.655079 1.070368 -1.602238
H  1.448927 2.36976 -1.832838
H  2.49181 2.360629 -0.376448
H  -3.81281 -1.006885 -0.425695
H  -4.076004 0.649978 0.205789
H  -3.586815 -0.650428 1.312729
