program: Gaussian 09
title: 000179122
version: EM64L-G09RevD.01
frameworkgroup: C1[X(C10H12Cl2O)]
method: RPBEPBE
basis: SDD
operation: Freq
keyword: #p
keyword: freq=noraman
keyword: PBEPBE/SDD
title: #p freq=noraman PBEPBE/SDD
converged: YES YES NO NO
title: Mulliken charges:
elementType: Cl Cl O C C C C C C C C C C H H H H H H H H H H H H
charge: 0.043433 0.039859 -0.111071 0.225681 -0.133855 -0.533539 -0.478108 0.213418 -0.413800 -0.542672 -0.764656 0.461697 -0.822134 0.278603 0.238985 0.223597 0.243934 0.224476 0.224336 0.238544 0.228770 0.229052 0.223367 0.233638 0.228446
chargesum: 0.00000
title: Mulliken charges with hydrogens summed into heavy atoms:
elementType: Cl Cl O C C C C C C C C C C
charge: 0.043433 0.039859 -0.111071 0.225681 0.144748 -0.533539 -0.015527 0.213418 -0.169866 -0.093860 -0.068289 0.461697 -0.136683
polarizability: 1.49198097e+02 2.38270636e-01 1.20373534e+02 1.01864570e+01 8.84769960e-01 1.02923559e+02
1716.lowfreq: -13.3505 -9.9376 -0.0023 -0.0018 0.0013 7.9870 36.1559 80.8335 106.5340
frequency: 35.7221 80.8216 106.5160 128.4974 169.1612 178.2916 185.0460 192.9215 218.4519 220.3403 243.6413 291.4390 320.2977 325.5312 367.1530 426.0424 450.8599 508.4027 569.5512 614.4789 675.4013 702.5248 715.5013 758.9889 768.0331 841.3206 856.7652 907.6207 941.2751 946.6985 971.9574 993.7445 1020.6757 1034.1383 1042.9022 1076.0091 1106.4163 1138.4250 1172.6463 1182.5502 1205.8586 1225.9273 1255.5577 1307.4797 1312.4229 1333.8270 1363.4962 1385.5860 1396.5955 1455.0860 1460.6140 1464.3099 1469.3863 1470.2508 1478.4760 1687.6572 1723.4834 2961.6320 2967.2330 2982.2788 2997.2464 3003.5790 3021.8904 3034.4710 3060.3600 3078.8810 3084.5364 3084.8998 3119.2909
redmass: 4.8556 4.6002 6.1778 4.3107 1.2528 1.6131 1.8977 8.2649 4.2799 3.3672 3.8087 3.3059 2.7028 3.3946 5.2053 2.2047 3.5426 3.8344 6.0659 4.8470 5.6864 4.1270 4.8542 2.5392 2.5955 2.1448 2.0884 2.3553 4.6833 1.9352 1.8412 1.8116 4.1719 1.8398 1.6147 1.5659 2.1768 1.6752 2.1021 2.2044 1.7626 1.4778 1.7175 1.3864 2.1433 1.3188 1.8954 1.1959 1.2374 1.0701 1.0582 1.0687 1.0664 1.0629 1.0553 6.7680 12.6627 1.0414 1.0591 1.0351 1.0635 1.0834 1.0928 1.0965 1.1038 1.0999 1.0984 1.0996 1.0910
irintensity: 0.4448 0.6615 0.5458 1.8513 0.9585 0.1309 0.1803 0.4464 0.5270 0.1701 1.9746 2.0421 3.0855 0.1827 2.2906 8.6823 7.3070 1.2464 50.2473 15.9938 23.0117 6.5082 7.8711 17.8309 44.1689 7.2804 57.8941 0.8512 22.7774 1.3889 24.2777 1.7938 6.7802 5.1524 8.7524 19.9322 9.4910 4.2750 0.8215 4.0121 2.0781 0.6965 7.9124 1.5577 0.9296 1.2912 4.6144 12.1464 13.8416 12.7093 4.0143 15.9528 22.7833 1.1122 13.9466 10.6864 181.2328 19.0574 50.4194 23.8575 15.2240 8.2610 29.4647 23.7452 23.7602 19.4397 15.8123 27.1259 15.1158
temp: 298.150 k
press: 1.00000 atm
elementType: 17 17 8 6 6 6 6 6 6 6 6 6 6 1 1 1 1 1 1 1 1 1 1 1 1
symmnumber: 1
zpe: 507689.6 jmol-1
zpe.correction: 0.193369 hartree
zpe.thermalcorrener: 0.207036 hartree
zpe.thermalcorrenthalpy: 0.207980 hartree
zpe.thermalcorrgfe: 0.152806 hartree
zpe.sumelectzpe: -1382.587136 hartree
zpe.sumelectthermal: -1382.573470 hartree
zpe.sumelectthermalent: -1382.572525 hartree
zpe.sumelectthermalfe: -1382.627699 hartree
dipole: 4.9487 0.7078 -1.6031
dipole: 5.2498
quadrupole: -93.5090 -91.1122 -91.3637
quadrupole: 2.1919 4.4004 -1.9185
quadrupole: -1.5140 0.8828 0.6313 2.1919 4.4004 -1.9185
hfenergy: -1382.7805052 hartree
pointgroup: C01 [X(C10H12Cl2O1)]
dipole: -1.8927566 0.6134354 0.5541743 debye
dipolederiv: -0.180778 -0.0414099 -0.0862616 -0.0295308 -0.3843316 -0.267687 -0.0636094 -0.2858396 -0.5057765 -0.5287794 0.2454284 -0.2579589 0.2265827 -0.3162467 0.1460344 -0.2937705 0.1819308 -0.3614907 -0.7802712 -0.2670431 0.2459107 -0.2230382 -0.5546561 0.1055549 0.2679636 0.1629941 -0.3458747 -0.3706674 0.1557295 0.1402635 0.2195891 -0.0658435 0.0358298 0.122285 -0.0466671 0.0866896 0.0887475 -0.1022898 0.0054207 0.1072719 -0.109116 0.0013302 -0.0938712 0.0315206 -0.0344915 0.7105487 -0.2900247 0.4038795 -0.2502037 0.3071186 0.1267403 0.3829699 0.2616717 0.930859 0.1159633 -0.0097471 0.0101371 -0.0269077 0.0842609 -0.0139884 0.119671 -0.0880319 0.0290912 0.878427 0.2112013 -0.4537747 -0.0454077 0.9755194 -0.1171738 -0.4013551 -0.2779501 0.1357594 -0.0934644 0.0706201 -0.0099311 0.1546241 -0.0559866 -0.0679168 0.0234638 -0.0548728 -0.1853771 -0.0363513 -0.0456046 0.0010879 -0.0634681 -0.0214774 0.079367 -0.0198668 0.0537997 0.1605193 -0.0052972 0.0466804 -0.0048301 -0.0536434 0.0218019 -0.0195365 -0.0217732 0.0208522 0.0306838 0.2695697 0.0469192 0.1148416 0.0126869 0.2043612 -0.0999068 0.1236867 -0.0750972 -0.0524407 -0.1138679 -0.0800079 -0.0150122 -0.0408396 0.0107554 0.0241475 -0.0637005 0.0155575 0.0714779 -0.0311096 0.0262372 -0.054001 -0.0100453 0.0539562 -0.0248622 -0.0574846 -0.0034866 -0.0631724 0.0275293 0.0020662 0.0217898 0.0115343 0.0366984 -0.1213273 0.0199593 -0.0720764 -0.043019 0.0152199 -0.0350274 0.0124725 -0.01848 -0.1478883 0.0990659 -0.0019817 0.0711225 0.0690696 0.0331743 -0.0569609 -0.0040732 -0.0820043 -0.0695619 0.0853956 -0.0329826 0.0762282 0.111499 -0.0737885 0.0263009 -0.1056689 -0.0022909 0.0721576 0.0021923 -0.1270854 0.0516388 -0.051639 0.062404 0.015788 0.0508708 0.0792151 -0.0735684 -0.0507786 0.0843616 -0.0982257 -0.0319545 0.0790576 -0.0665592 0.0205655 -0.0490421 -0.0818127 0.0352457 0.0416369 0.0935899 0.0339677 -0.0880552 0.064951 0.0939104 0.048462 0.046619 -0.0274403 0.0743859 -0.0414608 0.059266 0.0139571 0.0093885 -0.1152273 0.0537945 0.0700979 0.0588266 -0.0920901 -0.0004258 -0.0455274 -0.0797912 0.0599867 0.0456342 0.1023804 0.0085924 -0.0800729 0.0981117 -0.0560418 0.0670672 0.0730582 0.0269545 -0.0200055 -0.0736765 -0.1077464 0.0879688 0.0203533 0.102663 0.057305 0.014565 -0.0135773 -0.0400396 -0.0475629 0.0962963 0.0029915 -0.1092778 -0.0233936 -0.1224914 unknown
polarizability: 146.2361995|-6.9172507|122.1247813|12.4079255|-1.6269745|104.1342088 unknown
InChI: InChI=1S/C10H12Cl2O/c1-6-3-4-9(2)7(5-6)10(11,12)8(9)13/h5,7H,3-4H2,1-2H3
charge 0 multiplicity 1
25 atoms
Cl 1.038082 -1.991537 -1.4203
Cl 2.705785 -1.664042 1.123565
O  2.646741 1.149378 -0.88055
C  0.309842 1.061736 0.199871
C  0.103549 -0.377263 0.832693
C  1.379376 -0.893182 0.056449
C  -0.714682 1.326601 -0.945103
C  1.674688 0.586198 -0.364243
C  -1.235113 -1.030462 0.632016
C  -2.156771 1.028599 -0.476364
C  0.402977 2.239024 1.186756
C  -2.298996 -0.386608 0.076352
C  -3.667128 -1.026705 -0.028802
H  0.365088 -0.366152 1.908336
H  -0.491323 0.677557 -1.812514
H  -0.614277 2.374881 -1.2818
H  -1.347312 -2.055382 1.007906
H  -2.849344 1.159541 -1.330834
H  -2.479987 1.76638 0.287745
H  0.793034 3.137311 0.675557
H  -0.593118 2.478852 1.600601
H  1.07676 2.009329 2.031696
H  -4.436711 -0.399792 0.463897
H  -3.691757 -2.027255 0.435835
H  -3.975301 -1.130008 -1.088064
