program: Gaussian 09
title: 000179128
version: EM64L-G09RevD.01
frameworkgroup: C1[X(C14H13ClO)]
method: RPBEPBE
basis: SDD
operation: Freq
keyword: #p
keyword: freq=noraman
keyword: PBEPBE/SDD
title: #p freq=noraman PBEPBE/SDD
converged: YES YES NO NO
title: Mulliken charges:
elementType: Cl O C C C C C C C C C C C C C C H H H H H H H H H H H H H
charge: -0.025732 -0.126739 -0.295452 -0.511401 -0.511444 0.201526 0.311594 0.299951 0.095435 0.207671 -0.416394 -0.331703 -0.238732 -0.263403 -0.808727 -0.821680 0.270345 0.280205 0.304523 0.249629 0.245674 0.229001 0.225982 0.244512 0.227034 0.251741 0.232067 0.237579 0.236938
chargesum: 0.00000
title: Mulliken charges with hydrogens summed into heavy atoms:
elementType: Cl O C C C C C C C C C C C C C C
charge: -0.025732 -0.126739 -0.025107 -0.231196 -0.206921 0.201526 0.311594 0.299951 0.095435 0.207671 -0.166764 -0.086029 -0.009731 -0.037421 -0.085440 -0.115097
polarizability: 2.07853472e+02 -2.29741865e+01 1.73751038e+02 -9.60358627e+00 -1.10326883e+01 1.04960526e+02
1716.lowfreq: -3.7226 -0.0024 -0.0023 -0.0019 2.9627 11.3402 27.2364 60.6148 80.4991
frequency: 27.1012 60.6004 80.4927 97.2164 114.7315 146.0675 163.0991 190.6777 220.0946 222.1383 290.8376 328.1747 338.5351 362.7795 412.4095 461.5580 470.0984 483.4838 507.1424 544.9755 570.8966 601.3001 621.4592 690.7862 716.3660 739.7488 758.8200 778.5314 850.7626 877.7389 881.7764 895.8532 928.0629 952.7100 957.0997 965.0694 980.6643 988.2347 1000.1198 1024.7391 1043.5300 1072.9178 1078.1649 1098.1672 1117.5141 1165.1422 1173.1189 1181.2804 1187.7666 1191.9716 1223.4324 1225.5969 1253.3667 1298.5763 1307.8938 1386.1364 1389.1086 1399.7609 1449.8921 1457.2626 1463.8445 1471.4111 1476.9767 1485.5805 1581.6131 1610.4555 1663.1075 1724.4675 2962.4955 2967.8576 3030.3310 3040.1138 3048.0070 3050.0767 3064.4446 3080.4769 3105.7724 3128.3502 3140.6906 3160.6089 3192.1594
redmass: 6.9951 3.8722 3.7389 3.6139 3.4869 1.2731 7.5991 3.0851 1.6287 2.8878 5.0960 3.1273 3.5323 3.9469 3.7092 4.3554 3.6903 5.3700 3.4985 4.4931 4.5799 4.9243 4.2794 5.1971 5.2999 4.8916 1.5663 2.8667 2.9162 2.1325 2.2391 2.4932 3.0377 1.5888 1.3589 2.9824 1.4610 1.3253 3.6725 2.8765 2.1096 1.6098 1.4801 2.4701 1.7763 1.4221 1.3065 1.3883 1.2436 1.7917 1.8695 1.9592 1.8840 2.9884 1.6534 3.5107 1.4106 1.2156 2.5125 1.1349 1.9309 1.1367 1.0593 1.0948 6.4412 6.7675 8.0089 12.8540 1.0393 1.0386 1.0963 1.0846 1.0965 1.0857 1.0891 1.0984 1.0952 1.0856 1.0915 1.0984 1.0934
irintensity: 0.9945 0.0435 2.1807 1.9702 0.2283 0.4194 1.5166 0.1652 0.8959 3.6123 1.7747 0.5173 2.0176 0.4660 1.8693 3.1366 3.2285 11.8792 1.1436 17.3968 3.3263 0.4923 5.1397 8.4355 9.7206 4.7178 37.2502 37.7664 18.5749 2.5245 1.3919 17.3601 1.6819 0.7375 0.3623 14.5354 19.1527 0.0927 6.5536 15.6343 6.1837 4.3670 3.0230 20.4235 3.3629 10.0622 0.8355 5.6327 2.7923 6.8529 1.6352 4.0354 12.8021 2.4540 2.4901 16.4281 9.7143 6.7074 10.6799 13.3329 16.2552 16.3852 8.8203 6.0590 0.4465 5.2490 28.8744 180.4087 30.9383 33.9338 16.4068 4.8271 18.6205 4.1143 25.4861 30.3156 25.4835 0.3030 16.8202 28.9847 12.4640
temp: 298.150 k
press: 1.00000 atm
elementType: 17 8 6 6 6 6 6 6 6 6 6 6 6 6 6 6 1 1 1 1 1 1 1 1 1 1 1 1 1
symmnumber: 1
zpe: 594857.4 jmol-1
zpe.correction: 0.226569 hartree
zpe.thermalcorrener: 0.241111 hartree
zpe.thermalcorrenthalpy: 0.242055 hartree
zpe.thermalcorrgfe: 0.184233 hartree
zpe.sumelectzpe: -1075.403748 hartree
zpe.sumelectthermal: -1075.389206 hartree
zpe.sumelectthermalent: -1075.388262 hartree
zpe.sumelectthermalfe: -1075.446085 hartree
dipole: 1.7559 1.6214 2.9814
dipole: 3.8211
quadrupole: -93.0999 -99.9914 -101.1428
quadrupole: -1.3256 -5.7653 -11.6281
quadrupole: 4.9781 -1.9134 -3.0648 -1.3256 -5.7653 -11.6281
hfenergy: -1075.6303174 hartree
pointgroup: C01 [X(C14H13Cl1O1)]
dipole: 0.2373308 -0.8437859 1.2213441 debye
polarizability: 200.8899265|26.4721906|181.9195307|-7.3880719|9.0913779|103.7555787 unknown
InChI: InChI=1S/C14H13ClO/c1-7(2)10-8-5-3-4-6-9(8)11-12(10)14(16)13(11)15/h3-6,11-13H,1-2H3
charge 0 multiplicity 1
29 atoms
Cl 0.239062 3.31663 -1.102474
O  -2.637847 1.343796 -1.098825
C  -0.041784 1.344202 1.124364
C  -1.264718 0.378296 0.866652
C  -0.732161 2.445179 0.231433
C  -1.781043 1.391828 -0.20719
C  -0.700747 -0.934163 0.304081
C  1.138675 0.585983 0.554458
C  0.754007 -0.712376 0.094999
C  -1.472582 -2.040663 0.048239
C  2.46869 1.033531 0.473192
C  1.747953 -1.554209 -0.473526
C  3.451076 0.180475 -0.083688
C  3.084565 -1.102425 -0.555563
C  -2.975688 -2.046551 0.254493
C  -0.903941 -3.350357 -0.479744
H  0.126862 1.687458 2.157752
H  -1.970285 0.244264 1.703052
H  -1.193316 3.251287 0.829856
H  2.740026 2.03355 0.827587
H  1.500383 -2.545296 -0.857017
H  4.49181 0.514395 -0.156285
H  3.84729 -1.756093 -0.993837
H  -3.486451 -2.270751 -0.703086
H  -3.271049 -2.845014 0.964619
H  -3.375729 -1.085828 0.613028
H  -1.67602 -4.138883 -0.472113
H  -0.548335 -3.248917 -1.524052
H  -0.051899 -3.707048 0.128198
