program: Gaussian 09
title: 000179177
version: EM64L-G09RevD.01
frameworkgroup: C1[X(C25H24N2O3)]
method: RPBEPBE
basis: SDD
operation: Freq
keyword: #p
keyword: freq=noraman
keyword: PBEPBE/SDD
title: #p freq=noraman PBEPBE/SDD
converged: YES YES NO NO
title: Mulliken charges:
elementType: O O O N N C C C C C C C C C C C C C C C C C C C C C C C C C H H H H H H H H H H H H H H H H H H H H H H H H
charge: -0.319641 -0.278681 -0.310749 -0.395374 0.010154 -0.241886 -0.056345 0.518457 -0.702962 -0.708275 -0.390917 -0.436365 0.291858 -0.249337 -0.227066 -0.248496 -0.189586 0.497963 -0.483813 -0.433571 0.344933 -0.188401 -0.394761 -0.166506 0.343067 -0.360676 -0.384434 -0.202395 -0.193954 -0.257920 0.244186 0.191505 0.237140 0.216531 0.209860 0.228478 0.216748 0.218982 0.333919 0.232166 0.244914 0.229996 0.232846 0.236120 0.285233 0.292906 0.240410 0.233343 0.262245 0.265661 0.258571 0.244897 0.230199 0.228819
chargesum: 0.00000
title: Mulliken charges with hydrogens summed into heavy atoms:
elementType: O O O N N C C C C C C C C C C C C C C C C C C C C C C C C C
charge: -0.319641 -0.278681 -0.310749 -0.061455 0.010154 0.002300 0.135160 0.518457 -0.039430 -0.044067 -0.158751 -0.191452 0.291858 -0.019341 0.005780 -0.012376 0.095648 0.497963 -0.190907 -0.193161 0.344933 0.044943 -0.132516 -0.166506 0.343067 -0.095014 -0.125862 0.042502 0.036245 -0.029101
polarizability: 2.71342659e+02 9.27950136e+00 3.28863985e+02 -1.57286439e+01 -2.49173588e+01 2.48841121e+02
1716.lowfreq: -13.0474 -8.7652 -4.3806 -1.4792 -0.0007 0.0004 0.0005 10.7683 14.8228
frequency: -11.6103 9.5279 14.5320 21.2084 27.6550 34.3454 43.2241 48.8611 58.6626 61.8249 72.1908 81.4384 103.7011 129.2798 160.4862 187.2525 199.6235 214.5873 224.3683 231.9048 233.6428 247.8948 255.2267 301.3001 310.8344 313.8062 328.2319 349.2248 383.2280 398.6193 400.7437 406.6485 411.6679 425.2404 458.6617 480.1731 484.9541 528.3117 560.1849 561.9903 573.4935 597.3203 610.6649 611.5780 616.2214 627.1681 637.2007 681.2120 687.5173 691.6134 698.4162 706.6048 730.8610 766.8774 774.6219 795.1835 814.3837 819.3970 838.2833 855.5843 858.1252 897.4376 901.2559 907.8622 913.5236 916.4887 922.1013 929.8902 944.5703 960.9465 969.9781 972.1062 977.7705 979.3553 986.6530 987.8676 990.8432 991.5061 997.3730 999.9856 1018.5635 1026.4699 1072.0194 1075.8801 1077.7622 1083.7463 1125.0226 1136.8542 1137.8606 1166.3139 1171.6519 1173.1627 1174.1869 1174.6833 1184.2775 1190.5696 1195.4807 1208.1553 1234.4059 1260.1678 1271.6172 1275.3401 1294.6939 1307.8935 1311.7243 1319.8729 1336.4147 1353.6132 1380.5178 1381.0965 1381.5975 1392.6802 1398.8178 1438.7227 1441.1939 1443.7700 1467.5282 1469.6041 1470.0399 1475.8379 1477.4799 1482.3251 1482.7655 1489.2063 1591.4443 1593.3273 1596.9359 1606.6960 1611.4629 1613.9146 1679.6559 2201.8768 2959.2267 2976.1833 2981.0770 3007.0970 3028.1336 3067.8046 3076.6294 3083.7162 3086.9448 3117.0585 3123.6603 3130.9621 3135.6714 3137.3498 3140.6474 3147.3002 3154.5353 3155.5282 3162.6199 3164.2642 3165.1783 3174.3648 3175.6310 3550.6343
redmass: 5.0397 5.2429 4.5600 5.4941 5.1658 4.4138 4.5275 5.4070 4.3728 4.1913 5.1274 7.8387 4.7216 4.8722 5.2369 3.8973 1.3071 4.3439 2.0039 2.4284 3.1417 6.3153 2.7359 6.0256 6.3730 2.8646 4.3026 5.8773 3.2694 3.6601 2.8128 4.4593 3.0081 3.3384 3.6952 3.4351 3.6526 3.8404 4.9789 7.7681 1.3896 4.7160 4.8975 6.0239 6.3507 5.6231 6.2650 7.1864 10.5291 2.3989 2.1562 1.7305 4.2209 1.7273 1.9494 1.6477 3.3132 4.7433 1.2809 1.3917 2.1485 1.4678 1.4819 3.2698 1.5768 1.4135 1.5192 2.0953 3.0735 1.4649 3.9460 1.4300 1.3548 1.3945 6.0814 5.8391 6.0710 1.3022 3.5428 1.3240 2.1000 2.1911 2.2935 2.5397 1.6393 1.6796 2.0325 1.8863 2.1161 1.2186 1.4920 1.1989 1.1591 1.1630 2.2207 1.1435 2.0751 2.3717 2.5320 1.6233 1.5902 1.3556 1.4238 1.3523 1.4689 1.3463 1.2979 1.3059 1.2153 7.9770 5.9483 7.9060 1.2173 2.4781 2.1283 2.4756 1.0759 2.1075 1.0503 1.6919 2.4011 1.6175 1.3723 1.0539 5.9676 6.3073 6.5442 6.6029 6.0999 6.5610 10.5180 12.5828 1.0829 1.0365 1.0363 1.0826 1.0850 1.0989 1.0989 1.0999 1.0991 1.0867 1.0873 1.0851 1.0910 1.0876 1.0892 1.0958 1.0932 1.0931 1.0927 1.0965 1.1009 1.0998 1.0982 1.0771
irintensity: 0.0608 0.1296 0.2057 0.3563 0.6593 1.2966 1.2428 4.6169 3.2176 1.1368 0.7147 1.0977 0.6749 4.1860 1.3788 0.3881 0.9698 2.0162 1.5110 1.9307 1.3512 7.7425 1.3729 2.6254 9.2402 0.0104 5.1106 3.1154 0.8706 0.3437 0.0302 7.5235 0.5537 0.2450 8.3881 20.6935 3.5342 23.8050 4.5184 0.3435 126.1321 7.7093 17.4715 0.4098 0.7689 5.7830 4.7810 7.1513 24.3066 34.1926 19.3744 73.3752 7.2272 82.2652 57.3591 36.5381 27.5537 27.8268 1.4494 0.8600 6.0699 21.6918 5.0523 4.2101 9.2035 3.6048 43.7855 11.3165 28.8989 4.9585 211.5441 12.6215 1.3205 0.0760 4.9238 0.5492 1.6216 0.7592 111.4985 2.6428 12.9288 2.5486 17.2596 14.6846 29.3030 5.8401 2.4246 9.0496 5.5600 49.4097 16.5046 26.8278 4.5185 9.0996 192.5440 0.8367 105.8268 7.2664 198.9489 38.2997 9.3013 25.3916 27.6275 0.3765 17.2149 2.5136 36.4465 4.0229 12.1133 5.8389 0.1222 7.1678 16.2693 33.3786 8.1764 38.1549 22.1261 84.3073 3.6285 336.5956 40.5967 22.2760 36.8810 18.1598 3.2991 27.6021 117.5449 26.1206 4.4828 3.2450 280.0458 2.1384 20.2045 27.1304 28.2856 16.6858 5.9580 8.2283 57.5680 27.4807 46.8746 7.6105 2.3899 1.7599 8.1712 4.3830 5.0816 27.0623 34.2560 7.7262 1.3912 6.1141 19.4651 9.3458 8.1646 26.0922
temp: 298.150 k
press: 1.00000 atm
elementType: 8 8 8 7 7 6 6 6 6 6 6 6 6 6 6 6 6 6 6 6 6 6 6 6 6 6 6 6 6 6 1 1 1 1 1 1 1 1 1 1 1 1 1 1 1 1 1 1 1 1 1 1 1 1
symmnumber: 1
zpe: 1122900.0 jmol-1
zpe.correction: 0.427690 hartree
zpe.thermalcorrener: 0.455053 hartree
zpe.thermalcorrenthalpy: 0.455998 hartree
zpe.thermalcorrgfe: 0.365163 hartree
zpe.sumelectzpe: -1300.089406 hartree
zpe.sumelectthermal: -1300.062043 hartree
zpe.sumelectthermalent: -1300.061099 hartree
zpe.sumelectthermalfe: -1300.151933 hartree
dipole: 3.6711 3.9452 1.6800
dipole: 5.6448
quadrupole: -172.9892 -176.4780 -175.8704
quadrupole: -2.3897 -14.7074 -16.9866
quadrupole: 2.1233 -1.3655 -0.7579 -2.3897 -14.7074 -16.9866
hfenergy: -1300.5170965 hartree
pointgroup: C01 [X(C25H24N2O3)]
dipole: -1.4514691 -0.5546037 1.5867634 debye
polarizability: 260.0878407|13.6592768|294.4903795|11.3158747|-44.1428361|294.4695446 unknown
InChI: InChI=1S/C25H24N2O3/c1-18(2)24(19-10-5-3-6-11-19)27-25(28)30-23(17-26)20-12-9-15-22(16-20)29-21-13-7-4-8-14-21/h3-16,18,23-24,27H,1-2H3
charge 0 multiplicity 1
54 atoms
O  0.291703 -0.120788 -2.328739
O  -1.519212 1.396391 -2.143451
O  3.657334 0.945051 1.51934
N  -1.637596 -0.823562 -1.35845
N  2.849549 -0.0161 -4.567805
C  -3.009582 -0.765306 -0.792487
C  -4.019892 -1.612754 -1.629371
C  -2.944957 -1.142386 0.693492
C  -5.447654 -1.466493 -1.050678
C  -3.990723 -1.19893 -3.118232
C  -2.82405 -2.493926 1.109729
C  -2.95199 -0.12634 1.681718
C  -1.033614 0.254641 -1.943925
C  -2.714931 -2.820558 2.47997
C  -2.845477 -0.448407 3.053689
C  -2.726195 -1.798375 3.457961
C  1.119441 1.016036 -2.816575
C  1.819056 1.726654 -1.657304
C  2.389788 0.962593 -0.614041
C  1.893755 3.138056 -1.638841
C  3.021297 1.629342 0.457836
C  2.560896 3.786888 -0.574467
C  3.124263 3.03907 0.479921
C  2.070054 0.427332 -3.782223
C  3.150182 -0.296448 1.993218
C  1.764998 -0.553168 2.121404
C  4.111554 -1.230937 2.433683
C  1.345569 -1.777257 2.688873
C  3.677452 -2.448197 3.003535
C  2.296172 -2.72839 3.12933
H  -3.313561 0.294791 -0.880842
H  -3.724158 -2.681571 -1.562279
H  -5.506073 -1.797973 0.000734
H  -6.164359 -2.06661 -1.639884
H  -5.778884 -0.410972 -1.095148
H  -2.988909 -1.332323 -3.562413
H  -4.705579 -1.808676 -3.700208
H  -4.274919 -0.136243 -3.236321
H  -1.07919 -1.670363 -1.232299
H  -2.825002 -3.301414 0.367082
H  -3.039303 0.922457 1.372691
H  -2.628531 -3.869556 2.785136
H  -2.856835 0.349681 3.804173
H  -2.646984 -2.050713 4.521159
H  0.455228 1.73157 -3.340398
H  2.32903 -0.129627 -0.637056
H  1.430159 3.724636 -2.439463
H  2.627132 4.879664 -0.557316
H  3.633604 3.520794 1.319614
H  1.028032 0.188872 1.797974
H  5.173793 -0.992266 2.326198
H  0.273158 -1.976942 2.79309
H  4.419846 -3.177468 3.345834
H  1.964419 -3.674585 3.569935
