program: Gaussian 09
title: 000179121
version: EM64L-G09RevD.01
frameworkgroup: C1[X(C11H13NO4)]
method: RPBEPBE
basis: SDD
operation: Freq
keyword: #p
keyword: freq=noraman
keyword: PBEPBE/SDD
title: #p freq=noraman PBEPBE/SDD
converged: YES YES NO NO
title: Mulliken charges:
elementType: O O O O N C C C C C C C C C C C H H H H H H H H H H H H H
charge: -0.270270 -0.425566 -0.332051 -0.247118 -0.609338 0.319873 -0.319263 0.327771 0.111678 -0.768418 -0.706606 -0.412591 0.266749 -0.218903 -0.355357 0.271216 0.224721 0.262565 0.240096 0.201190 0.200586 0.241425 0.250558 0.247843 0.340372 0.227075 0.247422 0.343602 0.340736
chargesum: 0.00000
title: Mulliken charges with hydrogens summed into heavy atoms:
elementType: O O O O N C C C C C C C C C C C
charge: -0.270270 -0.085194 -0.332051 -0.247118 0.075000 0.319873 -0.094542 0.327771 0.111678 -0.064566 -0.014036 -0.164748 0.266749 0.008171 -0.107935 0.271216
polarizability: 1.59935078e+02 1.34108905e+00 1.57561433e+02 -9.37813184e+00 3.98239110e+00 9.40966244e+01
1716.lowfreq: -7.5561 0.0009 0.0010 0.0011 10.2548 12.6261 47.6719 57.1201 61.1719
frequency: 47.6106 56.9925 61.1607 72.7484 122.8822 172.3383 207.2825 211.6750 235.5592 254.8116 267.6327 303.0087 325.8054 336.0337 340.4778 366.3056 373.6200 482.1846 501.8482 514.2034 523.0857 527.0866 532.6152 550.5418 555.6825 610.9564 652.3158 692.5611 728.0382 732.2700 757.3347 792.0270 817.3991 845.8425 857.5775 906.0595 925.9808 939.5293 958.2513 970.1989 993.9340 1020.1780 1051.6973 1063.5841 1113.9889 1162.9553 1169.9681 1176.1322 1216.1731 1228.7594 1252.9878 1256.8806 1293.6623 1300.7106 1352.9792 1380.4561 1396.8206 1400.6083 1450.6840 1453.1016 1462.4979 1471.3744 1473.2160 1482.2545 1588.8001 1609.9946 1624.7532 1720.1853 2973.9698 2986.3233 2992.0153 3080.8217 3085.6753 3103.1168 3114.0536 3141.5537 3156.2980 3173.1219 3541.8819 3560.3197 3717.9872
redmass: 5.1023 5.8091 4.7839 4.7241 6.1340 4.0809 1.0671 3.0179 2.4550 1.5622 3.6730 2.5339 1.4623 2.5702 4.8212 3.5354 3.6384 4.0398 1.1879 4.4282 1.1907 2.7666 4.9167 4.0966 3.9038 6.4036 6.5830 9.3439 3.3557 5.2619 2.8473 2.3552 4.3686 3.7350 5.6916 1.4151 1.9129 1.6809 1.3970 2.7748 1.8437 2.8194 1.9749 2.0866 1.9278 1.2232 1.4032 2.0986 2.8399 1.7416 2.6932 3.0760 2.7113 1.9881 1.4006 1.2604 1.3186 4.8046 2.8503 1.1528 1.0483 1.2774 2.1454 1.0567 1.2301 6.2423 8.7525 9.2399 1.0842 1.0373 1.0383 1.0980 1.0974 1.0996 1.1003 1.0864 1.0926 1.0992 1.0659 1.0446 1.1057
irintensity: 0.1773 5.3615 11.9885 3.1293 0.7651 5.4702 1.7746 1.7874 1.6914 3.6401 2.8374 12.4187 92.4032 20.7920 3.3082 12.4637 21.5853 15.2337 236.6183 9.9009 59.1541 3.8680 0.6575 1.8826 5.3147 15.4286 1.7371 23.6813 23.6584 1.8034 43.7565 34.0380 46.4149 62.2301 71.5065 4.5140 8.4459 17.5713 14.4609 70.5078 23.5783 18.6733 35.3590 15.6218 100.1895 10.5661 27.1702 194.1756 23.6781 52.1701 89.1142 34.8344 312.6892 34.0009 11.0433 32.5502 11.8125 23.7843 80.6866 13.1871 2.9514 2.8165 40.0166 29.3868 111.9455 5.7283 31.4984 364.7841 34.3345 15.7452 30.8310 10.1539 31.8760 17.0765 13.9296 2.1230 11.2869 16.8822 5.3635 78.5918 51.8673
temp: 298.150 k
press: 1.00000 atm
elementType: 8 8 8 8 7 6 6 6 6 6 6 6 6 6 6 6 1 1 1 1 1 1 1 1 1 1 1 1 1
symmnumber: 1
zpe: 591708.9 jmol-1
zpe.correction: 0.225370 hartree
zpe.thermalcorrener: 0.240780 hartree
zpe.thermalcorrenthalpy: 0.241724 hartree
zpe.thermalcorrgfe: 0.183078 hartree
zpe.sumelectzpe: -781.433139 hartree
zpe.sumelectthermal: -781.417729 hartree
zpe.sumelectthermalent: -781.416785 hartree
zpe.sumelectthermalfe: -781.475430 hartree
dipole: -0.7648 -1.8797 -0.2765
dipole: 2.0480
quadrupole: -68.7336 -83.6725 -98.6103
quadrupole: 0.5247 -11.6900 5.3080
quadrupole: 14.9385 -0.0004 -14.9382 0.5247 -11.6900 5.3080
hfenergy: -781.6585087 hartree
pointgroup: C01 [X(C11H13N1O4)]
dipole: 0.3478828 -0.721766 0.0853393 debye
polarizability: 159.7680483|-1.0102657|157.5887771|-10.2411263|-2.9905763|94.2363104 unknown
InChI: InChI=1S/C11H13NO4/c1-11(2)9(13)6-4-3-5-7(8(6)16-11)15-10(12)14/h3-5,9,13H,12H2,1-2H3
charge 0 multiplicity 1
29 atoms
O  0.367807 -1.090679 0.368994
O  3.251245 0.563505 0.847114
O  -2.343739 0.02473 0.75242
O  -2.335536 -1.237904 -1.266079
N  -3.672288 -1.805269 0.583775
C  1.778477 -1.279021 -0.195211
C  2.37755 0.182808 -0.280202
C  1.140307 1.052615 -0.222619
C  0.045531 0.249747 0.164266
C  2.505502 -2.209825 0.77376
C  1.596593 -1.870548 -1.603466
C  0.984887 2.436114 -0.413236
C  -1.237276 0.808889 0.327893
C  -0.298135 3.007608 -0.226286
C  -1.40096 2.194729 0.135013
C  -2.746943 -1.055097 -0.102368
H  2.938763 0.291692 -1.231483
H  2.587094 -1.743101 1.768548
H  1.948581 -3.157179 0.869393
H  3.520173 -2.448607 0.40285
H  2.579354 -2.063115 -2.073317
H  1.039883 -2.8206 -1.5468
H  1.023495 -1.18181 -2.248948
H  1.841501 3.060336 -0.68694
H  4.104596 0.062641 0.774338
H  -0.4471 4.082643 -0.367787
H  -2.399441 2.623953 0.266753
H  -3.905669 -1.576408 1.546779
H  -4.094853 -2.604045 0.120348
