program: Gaussian 09
title: 000179095
version: EM64L-G09RevD.01
frameworkgroup: C1[X(C7H10O4)]
method: RPBEPBE
basis: SDD
operation: Freq
keyword: #pfreq=noraman
keyword: PBEPBE/SDD
title: #p freq=noraman PBEPBE/SDD
converged: NO YES NO NO
title: Mulliken charges:
elementType: O O O O C C C C C C C H H H H H H H H H H
charge: -0.237499 -0.200082 -0.412751 -0.235860 -0.036521 -0.462935 -0.412837 -0.549667 -0.465448 0.200786 0.178293 0.241782 0.244155 0.234048 0.225390 0.242294 0.269459 0.260698 0.291291 0.246871 0.378533
chargesum: 0.00000
title: Mulliken charges with hydrogens summed into heavy atoms:
elementType: O O O O C C C C C C C
charge: -0.237499 -0.200082 -0.034218 -0.235860 0.205261 0.015268 0.054847 -0.019511 0.072715 0.200786 0.178293
polarizability: 9.90316413e+01 1.58077481e+00 7.95603963e+01 5.17600442e+00 -1.65684894e+00 7.21907287e+01
1716.lowfreq: -0.0009 -0.0009 -0.0005 5.3110 7.8142 18.6875 25.7178 45.7023 93.5231
frequency: 25.3968 45.2827 93.5088 105.0349 128.2448 146.8669 235.5182 301.8928 424.9489 461.3524 478.3409 507.8318 516.4073 585.8872 621.6584 640.7892 679.9753 760.9037 789.4209 825.6660 854.3932 882.6462 942.5877 974.2341 1029.7373 1036.4454 1046.2829 1085.9781 1087.8042 1103.8269 1147.8393 1183.1699 1211.5419 1237.3865 1265.0895 1278.8355 1286.3060 1308.6024 1327.3119 1353.3853 1383.9640 1442.2163 1448.0895 1457.5414 1474.9765 1663.7643 1706.4084 2996.9257 3004.4821 3020.2891 3025.1214 3040.9013 3052.6744 3072.2684 3088.5752 3104.0715 3515.2690
redmass: 10.2591 6.1584 3.5936 3.4800 2.4754 2.6344 5.8437 3.5457 4.4408 3.7273 3.5903 1.9573 2.4343 4.3847 6.0659 1.3522 2.7108 3.7878 1.7355 2.2547 3.2695 3.9308 2.3114 2.4162 2.3250 2.5226 2.3496 2.0188 2.1961 3.1613 1.2957 1.3093 1.5789 1.3434 1.3753 1.1882 1.4333 1.4548 1.3801 1.5146 1.8585 1.0780 1.0802 1.0917 1.0931 8.1645 12.6498 1.0616 1.0601 1.0636 1.0651 1.0938 1.0932 1.0998 1.1017 1.1010 1.0640
irintensity: 2.7282 0.7780 8.4151 2.1560 1.1237 0.0500 1.0329 2.9749 3.6771 21.5015 15.9850 28.5845 6.9820 19.5317 6.4775 124.8017 18.3895 15.7539 9.3803 3.0825 50.6184 39.8453 28.9018 5.5730 25.6809 187.7318 83.9035 134.8289 44.0899 59.7958 27.1830 4.5019 13.7137 3.4228 4.5024 4.5165 16.2612 30.6631 4.6390 49.7191 17.6272 23.9327 9.7534 33.3641 13.1483 209.8543 337.5202 6.4771 14.5101 10.8473 17.9039 4.8028 9.1332 45.3940 10.5535 18.7628 23.1795
temp: 298.150 k
press: 1.00000 atm
elementType: 8 8 8 8 6 6 6 6 6 6 6 1 1 1 1 1 1 1 1 1 1
symmnumber: 1
zpe: 433741.2 jmol-1
zpe.correction: 0.165203 hartree
zpe.thermalcorrener: 0.176080 hartree
zpe.thermalcorrenthalpy: 0.177024 hartree
zpe.thermalcorrgfe: 0.126559 hartree
zpe.sumelectzpe: -572.803011 hartree
zpe.sumelectthermal: -572.792135 hartree
zpe.sumelectthermalent: -572.791190 hartree
zpe.sumelectthermalfe: -572.841656 hartree
dipole: -0.8644 -4.2048 -1.1615
dipole: 4.4471
quadrupole: -62.2919 -70.6843 -66.4828
quadrupole: -15.0531 1.8272 3.2653
quadrupole: 4.1944 -4.1979 0.0035 -15.0531 1.8272 3.2653
hfenergy: -572.9682143 hartree
pointgroup: C01 [X(C7H10O4)]
dipole: 0.4747156 1.6258532 -0.4386651 debye
dipolederiv: -1.2060523 -0.4021935 0.3114748 -0.1838125 -0.602719 0.0000965 0.4903568 0.2102847 -0.5458412 -0.7277891 -0.2872643 0.1528545 -0.4621454 -0.9522316 0.1361076 0.2064993 0.0919163 -0.4063013 -0.9895792 0.4320136 0.3106338 0.4234333 -0.7006817 -0.1329801 0.2372456 -0.0963333 -0.3841615 -0.639201 0.0326963 -0.1682981 0.1729686 -0.5366714 -0.2279347 -0.001719 -0.3294869 -0.7864628 0.5538591 0.1116286 -0.0072897 0.3592117 0.4914207 -0.096678 0.0809714 -0.0163602 0.35294 -0.0609053 0.0606693 0.0959608 -0.0101654 0.00373 0.0103421 0.0668701 -0.0367914 0.0619984 -0.0268197 0.0125551 -0.0478092 -0.008948 0.042586 -0.0151136 -0.0953927 -0.0335485 0.0056652 -0.0016906 0.0460606 0.1111883 0.0831728 -0.3215135 -0.1253883 0.117833 -0.1273941 0.0145571 -0.2333885 0.0540372 -0.1708721 -0.0949519 0.0381529 -0.113437 -0.3006269 -0.0603399 -0.0720131 1.3951873 0.5577324 -0.5647948 0.356094 1.2286854 -0.0041157 -0.8092243 -0.1974719 0.5980303 1.3744718 -0.4593776 0.0944887 -0.5199253 0.745447 0.4785849 0.0813648 0.5057804 0.981618 0.0032128 -0.030251 0.0607673 -0.0536044 0.0285426 0.0128756 0.0536554 0.0404368 -0.1208706 -0.0372566 0.0613706 -0.0841621 0.0293742 0.0571195 0.0449023 -0.0831629 0.0824804 -0.0577844 0.0719203 -0.0949153 -0.028969 -0.0769538 -0.0770104 -0.0448474 -0.0309204 -0.084743 0.0522198 0.0113414 -0.0700566 0.0124362 -0.0474805 -0.1159116 0.0245249 0.0110547 0.0129027 0.0908677 0.0540166 -0.0031533 0.0628785 0.0217221 0.0726385 0.026323 0.0761673 0.0086409 -0.0803385 -0.0834093 0.0261213 0.0217797 0.0050737 0.0934735 0.003499 0.0003411 0.0229925 0.1118723 0.0971873 -0.025525 -0.0775391 -0.0027954 0.0685741 0.0154425 -0.0368699 0.0247022 -0.0539869 0.1411212 -0.0384712 -0.0157977 0.0035219 -0.0169554 0.0257489 0.0143268 0.0202375 0.109419 0.0501723 0.0133742 0.0429545 0.0323192 0.0965027 0.051628 0.0702276 0.0137681 -0.0588807 0.2536013 0.0029486 -0.1118853 -0.026109 0.3568217 -0.0695804 -0.1489979 -0.0516734 0.1874533 unknown
polarizability: 99.8116985|0.2149825|79.4901421|-2.7274851|1.8897898|71.4809256 unknown
InChI: InChI=1S/C7H10O4/c8-6(9)3-1-5-2-4-7(10)11-5/h5,8H,1-4H2
charge 0 multiplicity 1
21 atoms
O  -1.267748 -0.665153 -0.896662
O  -3.00902 -1.72942 0.212701
O  3.837247 -1.096875 -0.100051
O  2.953283 0.35212 1.483615
C  -0.690092 0.724162 -0.965805
C  -1.843656 1.650396 -0.486392
C  0.572837 0.78713 -0.094501
C  -2.677071 0.745339 0.447732
C  1.618296 -0.264421 -0.51036
C  -2.399333 -0.68105 -0.045571
C  2.824411 -0.269544 0.405118
H  -0.43875 0.87427 -2.030005
H  -2.454213 1.971894 -1.347651
H  -1.45645 2.551339 0.017327
H  1.005738 1.802667 -0.179032
H  0.309869 0.646149 0.970415
H  -3.759809 0.943109 0.421745
H  -2.354597 0.813695 1.50304
H  1.166349 -1.274963 -0.495841
H  1.967488 -0.10746 -1.54856
H  4.60532 -1.100286 0.533838
