program: Gaussian 09
title: 000179071
version: EM64L-G09RevD.01
frameworkgroup: C1[X(C11H8Cl3N3O)]
method: RPBEPBE
basis: SDD
operation: Freq
keyword: #p
keyword: freq=noraman
keyword: PBEPBE/SDD
title: #p freq=noraman PBEPBE/SDD
converged: NO NO NO NO
title: Mulliken charges:
elementType: Cl Cl Cl O N N N C C C C C C C C C C C H H H H H H H H
charge: 0.076095 0.037781 0.000687 -0.267535 -0.234885 -0.035275 -0.386007 0.630795 0.301248 -0.253822 -0.418957 -0.274016 -0.351179 0.198628 -0.075914 -0.197289 -0.232957 -0.608171 0.266478 0.267686 0.245960 0.266101 0.311515 0.278273 0.227976 0.226782
chargesum: 0.00000
title: Mulliken charges with hydrogens summed into heavy atoms:
elementType: Cl Cl Cl O N N N C C C C C C C C C C C
charge: 0.076095 0.037781 0.000687 -0.267535 -0.234885 -0.035275 -0.074492 0.630795 0.301248 -0.253822 -0.152479 -0.274016 -0.083493 0.198628 -0.075914 0.048671 0.033144 0.124861
polarizability: 2.39363237e+02 6.96871324e+00 1.50932216e+02 1.86012174e+01 -1.83275196e-01 1.22776370e+02
1716.lowfreq: -6.6820 -3.4903 0.0015 0.0018 0.0023 0.7768 19.7671 32.5044 39.6592
frequency: 19.6957 32.5018 39.5351 43.3177 95.9520 102.8140 109.4294 123.2252 168.0242 193.1050 198.0931 214.9086 230.2357 263.0464 292.6337 294.7491 347.0694 373.3956 413.3771 448.7327 477.7213 505.4905 509.1243 537.3469 553.3765 593.4826 638.7254 646.9318 711.1810 717.0674 744.0431 751.8756 784.3285 791.8000 844.4922 907.5168 932.2817 971.6176 978.4844 1012.4023 1053.7519 1087.6830 1110.8322 1121.9517 1134.3671 1153.1481 1174.6034 1195.0943 1220.8833 1236.1199 1319.1387 1362.7853 1381.3243 1396.9240 1414.2374 1419.3653 1452.2756 1469.1739 1487.9065 1507.4262 1543.9253 1570.5383 1594.4832 1612.7127 2978.9388 3058.1930 3109.7711 3157.1050 3173.7349 3185.7859 3212.0398 3563.8008
redmass: 6.8783 6.6604 7.7358 12.0452 6.5869 1.4309 2.5451 9.0024 5.5121 22.8086 5.4381 6.1923 8.4214 8.1146 5.7143 7.8839 5.1132 11.8774 8.9155 8.7512 8.1470 5.7632 4.7832 4.4576 1.3353 5.2919 6.5475 8.6427 5.8815 3.2290 5.8793 7.0495 4.3808 1.5732 1.4355 1.4527 4.8990 4.4845 1.4910 7.4101 5.1078 3.3107 2.8246 1.2961 1.6213 1.5817 1.7815 1.5460 2.6874 2.5340 5.3602 11.4194 3.3180 4.9315 2.8182 1.1882 1.4295 3.6528 1.0503 1.6180 4.9792 7.0631 7.4599 7.2645 1.0350 1.1024 1.0980 1.0875 1.0931 1.1000 1.0972 1.0776
irintensity: 4.4053 1.0672 5.3893 0.4955 1.9233 0.1391 0.3281 0.5181 1.1931 0.1250 0.5504 1.1774 1.8978 3.9378 6.1557 4.2250 19.3042 2.3452 1.4789 2.5595 2.4606 7.5305 2.0275 44.2434 79.3343 0.5732 2.7490 2.1968 9.0061 18.4001 14.6284 36.7509 25.7031 59.4240 19.3768 3.3741 46.0498 31.9145 2.8876 18.0224 17.5468 2.2356 6.8773 0.1954 59.6681 11.4872 12.3355 5.2427 13.8140 80.2141 33.3783 2.6470 8.6834 29.4436 50.6843 37.8286 144.2824 43.1617 16.4961 23.6073 326.1361 20.9492 25.1125 154.8412 84.7173 36.0404 1.6151 4.1200 1.3001 3.5697 1.2449 17.9568
temp: 298.150 k
press: 1.00000 atm
elementType: 17 17 17 8 7 7 7 6 6 6 6 6 6 6 6 6 6 6 1 1 1 1 1 1 1 1
symmnumber: 1
zpe: 455018.5 jmol-1
zpe.correction: 0.173307 hartree
zpe.thermalcorrener: 0.190533 hartree
zpe.thermalcorrenthalpy: 0.191478 hartree
zpe.thermalcorrgfe: 0.125106 hartree
zpe.sumelectzpe: -2042.319335 hartree
zpe.sumelectthermal: -2042.302109 hartree
zpe.sumelectthermalent: -2042.301165 hartree
zpe.sumelectthermalfe: -2042.367537 hartree
dipole: 0.4053 2.3199 -2.2469
dipole: 3.2550
quadrupole: -104.3015 -118.7265 -128.8258
quadrupole: 9.4011 21.8422 4.5280
quadrupole: 12.9831 -1.4419 -11.5412 9.4011 21.8422 4.5280
hfenergy: -2042.4926426 hartree
pointgroup: C01 [X(C11H8Cl3N3O1)]
dipole: 0.1871845 0.4332449 -1.1904602 debye
dipolederiv: -0.0861455 -0.0154046 -0.1467929 -0.004327 0.0414854 0.0254885 -0.1399165 0.007425 -0.519479 -0.1486513 -0.2316352 0.0120386 -0.2312023 -0.4909472 0.0458723 0.0217944 0.0450401 0.0009651 -0.3907661 0.2833438 -0.0973513 0.370814 -0.391463 0.1153902 -0.1269943 0.117914 -0.0639889 -0.7615045 -0.0273678 0.1510736 -0.1354609 -0.4483888 -0.1579418 0.0953419 -0.2186617 -0.8447209 -0.7819278 -0.0726613 -0.0750972 -0.0702834 -0.0910534 0.0149147 0.0019541 0.0524175 -0.1798692 -0.3651839 -0.0348408 0.2110058 -0.1374722 -0.1771828 0.0262039 0.4417206 0.0131435 -0.2259517 -1.0989428 -0.2463141 -0.3006169 -0.2741855 -0.5465594 -0.0418106 -0.2972602 -0.0558964 -0.517427 0.8719085 -0.0527059 0.0094912 -0.0464498 0.0411456 0.0101272 0.1638522 0.0024311 0.0218774 -0.8560733 -0.0773568 0.0074822 -0.1022039 -0.0313769 -0.0042821 0.0355639 -0.0102935 -0.3156431 0.9174755 0.0656336 0.1686206 0.2316344 -0.0152063 -0.05456 -0.0488071 0.0011591 0.8071494 -0.0634886 0.0281447 -0.0812684 -0.0585855 -0.1070884 -0.0378649 -0.1520934 -0.0651985 0.2610496 -0.0083728 0.4562163 -0.0556329 0.4269658 0.6184076 -0.0187458 -0.1075419 -0.0472047 -0.0422924 -0.1468659 -0.0312519 0.0308284 -0.0099221 -0.0382718 -0.012834 0.0586926 -0.0218462 -0.0856993 1.7926165 0.3589206 0.1105243 0.4851146 0.4952686 0.3481285 0.0384002 0.4214369 1.0824343 0.448077 -0.5262309 0.1671142 -0.7044387 0.4398128 -0.1936282 0.1979575 -0.1833882 0.0346255 0.0023037 0.0693937 0.0045146 0.0591055 0.064769 -0.0372198 0.0253272 -0.036952 -0.1254802 -0.0697373 0.0582453 0.0025048 0.1600105 -0.1273255 0.0272844 -0.0188373 0.0163598 -0.0961344 0.5196558 0.0779933 0.0571439 0.0197439 0.2240426 -0.0892022 -0.1994406 -0.143765 0.0295234 0.0123382 -0.0086856 -0.0680169 0.0195956 0.1601149 -0.0026836 -0.0585339 0.0063625 0.0378334 0.0624889 0.0589779 -0.0299382 0.079021 0.0387796 0.0222831 -0.0295515 0.0352168 0.139459 0.0344684 -0.0550881 -0.0029012 -0.0656717 -0.0449841 0.0363763 -0.0089965 0.0369206 0.1527701 -0.0233146 -0.0169361 -0.0229127 -0.0082059 0.094726 0.0122443 -0.0326043 0.0151463 0.1556868 0.1625523 -0.0184569 0.0737317 0.0031554 0.2913789 -0.0762725 0.120664 -0.0626432 0.14208 0.1694098 -0.0065035 -0.0292104 0.0489502 0.1119739 -0.059746 0.1070882 -0.0315248 0.0123315 -0.0442841 -0.0519822 -0.0092676 -0.1321675 -0.1598446 0.0099366 0.0302793 0.0104885 0.1266477 -0.1480359 0.0165525 -0.0870673 0.0764654 0.0477874 0.0925416 -0.1180587 0.0959126 0.0122528 unknown
polarizability: 239.9110148|11.3010777|144.6346242|14.5851838|-11.4498963|128.5261828 unknown
InChI: InChI=1S/C11H8Cl3N3O/c1-15-11(18)6-5-16-17(10(6)14)8-4-2-3-7(12)9(8)13/h2-5,15H,1H3
charge 0 multiplicity 1
26 atoms
Cl -0.524847 0.024306 2.296739
Cl 1.585758 -2.303155 0.326477
Cl 4.791412 -1.874676 0.767048
O  -3.738932 0.187079 1.683838
N  0.106815 0.290476 -0.378605
N  -0.426198 0.345667 -1.684115
N  -4.412166 -0.736254 -0.351221
C  1.51919 0.440665 -0.18462
C  -2.117108 0.000008 -0.111988
C  -0.889626 0.099468 0.564059
C  -1.762261 0.162448 -1.493429
C  2.33075 -0.673227 0.154503
C  2.103631 1.711387 -0.374575
C  -3.466246 -0.168765 0.496758
C  3.719112 -0.487068 0.32612
C  3.493563 1.879919 -0.212672
C  4.305461 0.782506 0.145211
C  -5.80284 -0.942288 0.066755
H  -2.420033 0.194561 -2.361449
H  1.457591 2.549385 -0.650597
H  3.947207 2.864363 -0.359443
H  5.383966 0.900555 0.281005
H  -4.111762 -1.099528 -1.256214
H  -5.909645 -0.517982 1.077939
H  -6.057508 -2.017789 0.106539
H  -6.506383 -0.43106 -0.615863
