program: Gaussian 09
title: 000179083
version: EM64L-G09RevD.01
frameworkgroup: C1[X(C15H16ClN3O)]
method: RPBEPBE
basis: SDD
operation: Freq
keyword: #p
keyword: freq=noraman
keyword: PBEPBE/SDD
title: #p freq=noraman PBEPBE/SDD
converged: NO NO NO NO
title: Mulliken charges:
elementType: Cl O N N N C C C C C C C C C C C C C C C H H H H H H H H H H H H H H H H
charge: 0.066611 -0.271594 -0.383366 -0.215479 -0.031085 -0.093754 -0.471417 -0.514585 0.218472 0.246887 -0.282468 -0.432696 0.512240 0.362456 -0.588426 0.332272 -0.385931 -0.407808 -0.810778 -0.808376 0.278965 0.234176 0.248091 0.247845 0.231015 0.304140 0.261881 0.270735 0.265045 0.236424 0.235837 0.228703 0.226837 0.228320 0.232298 0.228514
chargesum: 0.00000
title: Mulliken charges with hydrogens summed into heavy atoms:
elementType: Cl O N N N C C C C C C C C C C C C C C C
charge: 0.066611 -0.271594 -0.079226 -0.215479 -0.031085 0.185211 0.010850 -0.035725 0.218472 0.246887 -0.282468 -0.170814 0.512240 0.362456 -0.317691 0.332272 -0.120886 -0.171384 -0.119401 -0.119245
polarizability: 3.24426021e+02 9.51227547e+00 1.88699548e+02 4.04921005e+00 -4.44513769e+00 1.13089713e+02
1716.lowfreq: -24.7850 -4.8826 -3.0777 -0.0017 -0.0016 -0.0008 4.3186 25.1579 32.1402
frequency: -24.5739 25.0626 31.5133 44.0243 49.7583 74.7679 88.8294 108.3399 137.7067 152.9368 170.1784 181.9271 201.8919 229.8035 242.0691 273.4778 294.8639 320.0080 352.4527 374.0952 406.3138 416.7859 438.2003 450.8473 507.4630 511.9357 528.9304 546.2104 594.8839 630.2415 639.9422 649.0528 719.3350 739.1017 741.9320 751.4700 779.6717 799.6404 824.8984 836.1209 850.5900 865.3563 894.8537 922.8142 937.5496 953.5659 965.9934 991.4722 999.3858 1030.6742 1031.1563 1037.7160 1053.4520 1057.8579 1059.7479 1108.9640 1129.4311 1147.8025 1160.9507 1172.3609 1189.8588 1208.3861 1225.3561 1245.4324 1252.8868 1284.4116 1316.3615 1350.3841 1376.6040 1378.1778 1393.6722 1397.6541 1406.3435 1428.9573 1437.2867 1460.8322 1463.4157 1470.2518 1474.6124 1478.2117 1486.8152 1503.2442 1531.7642 1590.4126 1596.5728 1624.7394 2971.8471 2973.9018 3043.2555 3047.5733 3087.5789 3091.1446 3091.3384 3102.5091 3133.3250 3161.0113 3166.2985 3176.4490 3191.7350 3210.3009 3212.9730 3547.9969
redmass: 2.6348 4.7681 4.6649 7.5267 4.6535 3.3791 1.1114 4.7542 2.1198 1.7280 5.2117 4.2014 3.5502 4.6433 8.3668 4.4253 2.6298 6.4274 3.9277 3.6663 2.6404 5.5451 3.5991 3.2663 3.2481 1.8246 4.1243 4.1002 4.0639 6.2977 6.9193 6.8459 2.8481 4.5542 4.7465 1.2557 3.7095 1.5646 1.3388 1.4949 2.1931 5.5860 1.4308 2.9023 3.1952 1.3486 2.8350 1.6534 1.7114 1.6640 1.5634 2.2928 1.6497 1.2875 2.8576 1.1913 2.0950 2.3258 1.4035 1.8363 1.8959 2.4666 1.8567 3.2214 2.2365 1.4014 3.4703 2.0580 3.7893 5.2993 1.2451 5.3945 1.2980 2.9016 1.0912 1.0468 1.2887 1.2828 1.0690 1.1387 2.2251 2.7426 7.2531 7.0411 7.2687 6.4604 1.0377 1.0385 1.0968 1.0967 1.0984 1.0534 1.0978 1.0610 1.0899 1.0922 1.0915 1.0955 1.1162 1.0970 1.1140 1.0774
irintensity: 0.9098 3.1397 0.5193 4.0179 1.8496 0.6993 0.0056 0.0823 2.0987 0.2544 0.6367 2.9407 1.3195 4.2919 4.0858 6.4945 0.0610 7.3179 3.0342 7.8166 2.8030 2.9680 1.3411 3.4790 14.4366 65.6031 2.3630 7.0017 4.4067 6.1322 7.5419 2.7776 2.8678 7.6127 5.3219 0.6831 14.4847 18.0101 32.6178 12.0333 15.7125 37.2758 11.7024 17.1495 76.3959 0.9556 15.4081 7.0128 6.9554 11.1538 9.8857 7.6573 0.0848 10.8268 10.5236 2.2529 7.6961 1.7423 0.7503 8.0104 24.7843 6.2391 7.7365 24.0087 101.0788 1.6067 17.3827 58.7578 1.4391 16.1922 4.1317 59.5757 14.5851 18.7711 10.0554 0.0250 12.4752 28.5957 26.6116 9.0379 232.4435 81.5107 333.3647 13.8776 185.3451 7.5442 61.7430 12.9449 39.3990 0.8065 30.3429 19.9007 9.2839 9.3962 19.0716 1.6808 5.8513 2.8407 2.5371 2.4594 27.5332 16.5642
temp: 298.150 k
press: 1.00000 atm
elementType: 17 8 7 7 7 6 6 6 6 6 6 6 6 6 6 6 6 6 6 6 1 1 1 1 1 1 1 1 1 1 1 1 1 1 1 1
symmnumber: 1
zpe: 735824.6 jmol-1
zpe.correction: 0.280261 hartree
zpe.thermalcorrener: 0.299024 hartree
zpe.thermalcorrenthalpy: 0.299968 hartree
zpe.thermalcorrgfe: 0.231297 hartree
zpe.sumelectzpe: -1279.246209 hartree
zpe.sumelectthermal: -1279.227446 hartree
zpe.sumelectthermalent: -1279.226502 hartree
zpe.sumelectthermalfe: -1279.295172 hartree
dipole: 1.9171 -3.3101 0.8419
dipole: 3.9167
quadrupole: -92.6150 -123.8036 -126.8881
quadrupole: 13.6122 -0.3140 -3.4323
quadrupole: 21.8206 -9.3680 -12.4525 13.6122 -0.3140 -3.4323
hfenergy: -1279.5264694 hartree
pointgroup: C01 [X(C15H16Cl1N3O1)]
dipole: -0.7578039 1.2899113 -0.36935 debye
polarizability: 324.0358559|4.9497683|172.6279554|-12.4506858|-31.3053773|129.5514709 unknown
InChI: InChI=1S/C15H16ClN3O/c1-9-3-6-12(7-10(9)2)19-14(16)13(8-17-19)15(20)18-11-4-5-11/h3,6-8,11,18H,4-5H2,1-2H3
charge 0 multiplicity 1
36 atoms
Cl 0.20985 -1.924386 1.728604
O  3.29983 -1.896723 0.7342
N  4.018897 0.115537 -0.202844
N  -0.607933 -0.265604 -0.36292
N  -0.125335 0.602791 -1.358689
C  5.420504 -0.154781 0.02694
C  6.446215 -0.067423 -1.115766
C  6.432882 0.98897 0.00951
C  3.03042 -0.800069 0.149794
C  1.65077 -0.392095 -0.228805
C  0.443099 -0.859624 0.32276
C  1.228716 0.515215 -1.255693
C  -2.030834 -0.390348 -0.18643
C  -4.232132 0.700709 -0.174225
C  -2.82854 0.769114 -0.31502
C  -4.84774 -0.559883 0.103395
C  -2.627609 -1.643969 0.065036
C  -4.028564 -1.709111 0.215445
C  -5.07041 1.958036 -0.315762
C  -6.352101 -0.670922 0.266445
H  5.54493 -0.959684 0.754997
H  6.084236 0.237363 -2.10242
H  7.253812 -0.804098 -1.136123
H  7.233951 0.979878 0.753229
H  6.076069 1.993334 -0.24427
H  3.748791 1.026173 -0.577713
H  1.838212 1.067909 -1.969931
H  -2.339298 1.722216 -0.536665
H  -2.021889 -2.551332 0.128401
H  -4.496607 -2.68018 0.412919
H  -4.440018 2.840936 -0.512378
H  -5.796242 1.869269 -1.14694
H  -5.659179 2.158679 0.599799
H  -6.885209 -0.337632 -0.644767
H  -6.656536 -1.710173 0.474517
H  -6.719308 -0.038192 1.097171
