program: Gaussian 09
title: 000179100
version: EM64L-G09RevD.01
frameworkgroup: C1[X(C20H24O5)]
method: RPBEPBE
basis: SDD
operation: Freq
keyword: #pfreq=noraman
keyword: PBEPBE/SDD
title: #p freq=noraman PBEPBE/SDD
converged: NO YES NO NO
title: Mulliken charges:
elementType: O O O O O C C C C C C C C C C C C C C C C C C C C H H H H H H H H H H H H H H H H H H H H H H H H
charge: -0.275923 -0.203078 -0.205156 -0.220275 -0.200861 0.314731 -0.186027 0.196830 0.307476 -0.496904 -0.607342 -0.488531 -0.516790 -0.180084 -0.849249 0.239144 -0.432577 -0.791830 -0.461048 -0.360683 0.081524 0.356261 -0.423600 -0.476701 0.182697 0.205882 0.239561 0.231165 0.242093 0.259648 0.224786 0.232136 0.236225 0.222578 0.230841 0.257033 0.216033 0.238177 0.223781 0.234465 0.246829 0.214746 0.241742 0.227487 0.229855 0.256478 0.244731 0.242899 0.298824
chargesum: 0.00000
title: Mulliken charges with hydrogens summed into heavy atoms:
elementType: O O O O O C C C C C C C C C C C C C C C C C C C C
charge: -0.275923 -0.203078 -0.205156 -0.220275 -0.200861 0.314731 0.019855 0.196830 0.307476 -0.026178 -0.105601 -0.031609 -0.057987 0.050757 -0.138005 0.239144 0.025669 -0.088513 -0.003706 -0.104205 0.081524 0.356261 0.064030 -0.177877 0.182697
polarizability: 2.58152168e+02 -1.85960858e+01 2.13518850e+02 -9.16600728e+00 1.47689656e+01 1.83386762e+02
1716.lowfreq: -0.0001 0.0005 0.0007 4.5923 9.4043 16.0026 29.3228 35.3007 52.6457
frequency: 29.0174 35.2763 52.5873 73.6015 109.5864 114.4740 148.9002 153.5899 170.6356 179.5663 195.0422 206.2473 215.8811 238.5723 245.2419 248.6626 274.0943 285.5746 298.9950 304.1042 338.5417 354.0378 368.6169 377.0971 414.2979 421.9217 429.0242 463.2964 470.2982 490.5290 505.5449 527.8712 543.1997 588.1614 605.9274 626.8447 637.9090 652.9154 659.0184 671.2226 679.6655 702.7144 719.4381 736.1540 792.1729 798.2280 809.4497 839.3400 852.6207 866.6319 883.8973 887.0743 893.6580 913.2241 923.3819 928.2359 935.4015 943.9183 948.7802 954.9355 973.1426 977.3317 981.9732 985.6108 1007.1615 1012.8858 1035.0748 1047.2628 1057.3001 1084.1944 1088.6029 1099.2636 1112.5009 1121.9773 1133.6733 1139.0888 1150.5434 1157.4658 1167.0961 1180.6554 1181.8080 1189.6242 1205.8883 1231.9217 1234.5888 1241.0156 1251.6397 1257.6229 1275.3936 1288.1322 1302.3233 1308.5426 1310.5407 1313.5969 1328.4711 1334.4571 1342.8738 1346.3953 1350.3534 1354.5804 1389.8107 1400.2289 1447.2618 1447.4524 1458.6235 1460.9042 1465.4596 1472.7499 1475.4549 1476.6208 1487.6278 1495.1254 1512.3806 1645.2466 1695.3557 1698.7698 1709.6725 2938.8135 2940.4702 2954.1538 2985.5689 2993.0516 2995.2378 2999.2961 3000.5346 3002.1814 3003.5479 3018.0837 3026.4764 3044.8402 3044.9878 3056.4218 3072.3104 3074.9990 3091.9695 3098.6647 3101.4387 3102.3428 3113.5050 3118.6604 3235.4335
redmass: 9.3415 4.8648 4.7715 4.6852 4.3116 6.3570 2.7987 4.7555 2.0608 1.9750 4.6393 2.8998 3.3463 2.2292 2.5382 2.0585 3.4825 2.4266 3.7387 3.4995 3.2207 2.1554 2.1984 1.9416 2.7611 2.8830 3.2429 4.5839 3.6638 3.1738 3.6680 3.3102 4.0651 5.6594 3.3264 3.4538 3.2095 4.5224 5.2267 4.5045 5.2395 5.3862 4.5512 3.2340 2.8594 4.0021 2.0840 2.3780 2.7174 3.0270 1.9231 1.7311 1.8959 2.2994 2.7330 2.5534 3.0890 2.3945 2.8162 2.0550 2.4793 2.4413 2.0434 1.9214 3.7967 2.3108 2.1450 1.9820 2.1308 3.4307 2.1048 2.1898 1.8360 2.3713 1.3487 1.7923 1.8987 1.7317 2.4538 2.0499 2.0309 1.3966 1.8518 1.7310 1.7271 1.5138 1.5697 1.7751 1.4744 1.2854 1.4645 1.4598 1.5705 1.5240 1.3798 1.3866 1.4628 1.7401 1.7449 1.5238 1.2381 1.1891 1.0849 1.0844 1.0657 1.0639 1.0851 1.0821 1.0632 1.0692 1.0825 1.0670 1.0524 7.9532 10.6322 9.7479 12.3561 1.0831 1.0827 1.0654 1.0388 1.0572 1.0597 1.0640 1.0717 1.0619 1.0465 1.0725 1.0643 1.1049 1.1007 1.1020 1.0983 1.0994 1.0981 1.0971 1.1027 1.0979 1.0983 1.0917 1.0984
irintensity: 0.9292 0.6176 0.3122 3.8437 1.6842 3.5674 1.8015 2.1127 1.0048 0.9449 0.5922 0.8469 3.4687 1.3778 1.4036 1.2859 1.3283 4.0248 1.4599 1.4837 5.5725 0.7096 1.4647 0.9127 1.6519 4.5327 3.4103 4.1974 0.8927 0.8130 1.2252 1.1192 5.4831 5.7977 2.1805 2.8914 3.3210 0.2674 1.8395 5.5115 3.4678 2.3547 13.3107 15.6726 28.1185 32.5697 5.1685 1.1135 6.5218 41.9324 31.6259 13.0447 15.5036 48.5748 29.2987 59.7289 29.8304 2.7618 35.9687 24.8205 11.8114 11.0397 14.1256 13.8235 69.8615 13.2546 1.8502 11.8481 7.1079 65.6528 34.6642 40.5346 0.6713 8.5119 0.9435 9.5961 7.6604 6.9825 54.2094 5.7799 0.3421 6.4008 12.3702 3.5916 6.6546 7.7704 12.1983 3.3933 0.6619 16.9540 2.9479 2.6758 0.4319 3.2962 3.4384 0.3748 1.0966 3.5949 0.6807 3.5082 23.4551 30.3389 10.3080 23.3417 2.1547 7.7641 8.2271 0.8737 15.2411 22.8928 6.7707 5.3066 3.3002 34.7611 180.3299 203.2872 492.5171 21.9486 32.2082 28.2609 22.9385 21.9298 18.6690 41.7087 4.1145 26.9929 8.1953 40.4051 18.5737 13.6650 14.9361 32.8527 20.8682 36.2554 17.3194 25.1995 26.8599 21.9429 20.3375 6.4546 1.4231
temp: 298.150 k
press: 1.00000 atm
elementType: 8 8 8 8 8 6 6 6 6 6 6 6 6 6 6 6 6 6 6 6 6 6 6 6 6 1 1 1 1 1 1 1 1 1 1 1 1 1 1 1 1 1 1 1 1 1 1 1 1
symmnumber: 1
zpe: 1056596.6 jmol-1
zpe.correction: 0.402436 hartree
zpe.thermalcorrener: 0.424289 hartree
zpe.thermalcorrenthalpy: 0.425233 hartree
zpe.thermalcorrgfe: 0.352776 hartree
zpe.sumelectzpe: -1150.750638 hartree
zpe.sumelectthermal: -1150.728785 hartree
zpe.sumelectthermalent: -1150.727841 hartree
zpe.sumelectthermalfe: -1150.800298 hartree
dipole: 4.0963 -9.2714 -3.5424
dipole: 10.7372
quadrupole: -190.6150 -174.1726 -139.9006
quadrupole: -4.3890 6.6703 -0.0453
quadrupole: -22.3856 -5.9432 28.3288 -4.3890 6.6703 -0.0453
hfenergy: -1151.153074 hartree
pointgroup: C01 [X(C20H24O5)]
dipole: 1.5161489 3.7091253 1.3374041 debye
polarizability: 257.1417512|19.7516486|214.9557868|8.7811517|14.537148|182.9602421 unknown
InChI: InChI=1S/C20H24O5/c1-18-9-14(12-8-16(21)23-10-12)25-19(18,2)6-7-20-11-24-17(22)13(20)4-3-5-15(18)20/h4,8,14-15H,3,5-7,9-11H2,1-2H3
charge 0 multiplicity 1
49 atoms
O  -1.786832 1.752618 -0.837059
O  2.013687 -2.833867 0.246172
O  4.293484 -3.145194 -0.168697
O  -4.870777 -1.401869 1.094307
O  -5.430715 -2.197737 -1.043283
C  0.240213 1.625194 0.488158
C  1.65691 0.96347 0.699906
C  1.848213 -0.410449 -0.028987
C  -0.297344 1.573205 -0.997162
C  1.414239 -0.294893 -1.525608
C  -0.892171 0.844043 1.236633
C  -0.046524 0.186564 -1.652001
C  2.829787 1.912482 0.285569
C  -2.199104 1.274701 0.499791
C  0.218458 3.074408 1.048505
C  3.298494 -0.879992 0.078991
C  1.154709 -1.661073 0.608358
C  0.124212 2.708399 -1.941771
C  4.234741 1.367134 0.636355
C  4.375681 -0.109205 0.3685
C  3.342243 -2.367757 0.01774
C  -3.233448 0.186422 0.394956
C  -3.935743 -0.385699 1.616284
C  -3.723573 -0.420853 -0.720021
C  -4.74859 -1.429958 -0.347847
H  1.761292 0.78321 1.793682
H  1.525719 -1.279806 -2.017772
H  2.097683 0.395195 -2.054511
H  -0.921615 1.112279 2.307469
H  -0.759355 -0.246182 1.167469
H  -0.331819 0.245611 -2.718813
H  -0.72969 -0.55499 -1.197229
H  2.710694 2.890729 0.779839
H  2.783386 2.102753 -0.802603
H  -2.656176 2.141116 1.025389
H  -0.802407 3.493533 1.011437
H  0.553007 3.078487 2.10329
H  0.867552 3.764374 0.486987
H  1.119721 -1.597442 1.712623
H  0.159129 -1.897685 0.204846
H  -0.076519 3.699778 -1.50651
H  1.194252 2.644885 -2.204636
H  -0.461039 2.630549 -2.874702
H  4.461585 1.542998 1.710305
H  5.007878 1.934088 0.080006
H  5.359618 -0.585232 0.479932
H  -3.244975 -0.883168 2.323107
H  -4.521138 0.376888 2.164262
H  -3.449234 -0.209566 -1.75156
