program: Gaussian 09
title: 000179072
version: EM64L-G09RevD.01
frameworkgroup: C1[X(C11H8Br2ClN3O)]
method: RPBEPBE
basis: SDD
operation: Freq
keyword: #p
keyword: freq=noraman
keyword: PBEPBE/SDD
title: #p freq=noraman PBEPBE/SDD
converged: YES YES NO NO
title: Mulliken charges:
elementType: Br Br Cl O N N N C C C C C C C C C C C H H H H H H H H
charge: 0.065112 0.049627 0.080312 -0.267761 -0.238068 -0.030897 -0.386772 0.606860 0.307616 -0.263180 -0.417434 -0.368102 -0.309845 0.195458 -0.133968 -0.172433 -0.227999 -0.608110 0.264926 0.270265 0.277671 0.262106 0.311409 0.278378 0.227865 0.226965
chargesum: 0.00000
title: Mulliken charges with hydrogens summed into heavy atoms:
elementType: Br Br Cl O N N N C C C C C C C C C C C
charge: 0.065112 0.049627 0.080312 -0.267761 -0.238068 -0.030897 -0.075363 0.606860 0.307616 -0.263180 -0.152509 -0.368102 -0.039581 0.195458 0.143703 0.089673 -0.227999 0.125098
polarizability: 2.89149922e+02 1.70595542e+01 1.45447281e+02 -1.59866918e+01 5.87624337e+00 1.28466398e+02
1716.lowfreq: -7.0592 -6.0786 -3.2212 -0.0023 -0.0021 -0.0020 18.1218 24.9779 33.8238
frequency: 18.1119 24.9253 33.8024 40.6666 94.4844 99.9600 109.3430 117.5589 126.5951 143.3411 164.5456 185.4426 218.2544 257.6926 276.7789 293.3727 306.5522 358.1316 373.5620 428.7454 461.6065 483.7976 503.8739 548.1813 556.0375 581.9330 631.9633 642.3160 658.4591 721.0953 737.6899 746.3461 781.0394 827.6096 842.9860 878.6736 925.5062 961.2606 966.8777 1007.2852 1055.6109 1071.8458 1097.8019 1122.4954 1134.5001 1139.6000 1174.6051 1212.3128 1235.7764 1248.7871 1319.0730 1349.3637 1361.4598 1387.5109 1399.6905 1418.0252 1453.7233 1471.7453 1487.4357 1507.7493 1542.8749 1560.9490 1584.4999 1610.1941 2978.5037 3057.6815 3109.5878 3164.2192 3183.1463 3186.0865 3209.3750 3562.5401
redmass: 10.3180 7.1442 8.9114 6.7937 5.3635 3.8853 1.2955 8.7220 9.3631 6.5257 5.3328 13.5721 6.7099 8.5207 8.1927 7.7778 5.2495 5.1665 11.9729 4.1255 5.6539 6.5728 9.0296 3.0803 1.5395 3.7658 7.2030 6.6427 8.2882 4.0010 7.6545 5.6848 4.2135 1.4181 1.4508 1.4204 6.0070 1.4742 5.1159 6.2379 7.0712 2.2217 4.8682 1.2936 1.6192 1.3555 1.9664 3.5794 2.4410 1.3289 5.3123 3.5840 6.3630 4.2235 4.6655 1.1853 1.3805 3.4046 1.0482 1.6447 4.6886 8.5382 7.3881 7.1664 1.0349 1.1024 1.0981 1.0896 1.0939 1.0970 1.0973 1.0776
irintensity: 1.8902 1.0127 0.1969 6.6921 0.5903 1.9827 0.5074 0.1718 0.4557 0.2057 0.7220 0.1071 1.5883 1.4572 2.6389 4.3095 12.9533 7.7364 14.9240 6.6499 8.1453 6.4150 7.2341 59.1190 62.9139 8.8946 1.6207 3.4442 4.0888 1.0107 33.3466 24.2204 5.2153 42.0117 19.4095 12.9963 93.5569 4.3485 17.8113 26.2633 25.4265 32.9520 3.8044 0.1718 59.4555 0.7534 5.1174 16.9372 94.5260 1.1453 33.6265 5.9133 10.3500 21.4845 23.5281 38.6178 162.5995 146.8882 16.0388 18.4486 322.7123 23.8586 35.6077 160.4293 86.5812 35.8249 1.5959 1.1106 0.0393 0.8535 1.4449 17.5665
temp: 298.150 k
press: 1.00000 atm
elementType: 35 35 17 8 7 7 7 6 6 6 6 6 6 6 6 6 6 6 1 1 1 1 1 1 1 1
symmnumber: 1
zpe: 451800.7 jmol-1
zpe.correction: 0.172082 hartree
zpe.thermalcorrener: 0.189857 hartree
zpe.thermalcorrenthalpy: 0.190801 hartree
zpe.thermalcorrgfe: 0.121625 hartree
zpe.sumelectzpe: -1149.122042 hartree
zpe.sumelectthermal: -1149.104267 hartree
zpe.sumelectthermalent: -1149.103323 hartree
zpe.sumelectthermalfe: -1149.172499 hartree
dipole: 0.3749 0.1211 -2.7943
dipole: 2.8219
quadrupole: -111.7291 -123.7442 -136.4086
quadrupole: 7.5287 -19.2035 3.6841
quadrupole: 12.2315 0.2164 -12.4479 7.5287 -19.2035 3.6841
hfenergy: -1149.2941239 hartree
pointgroup: C01 [X(C11H8Br2Cl1N3O1)]
dipole: -0.1698666 -0.3457217 -1.0412535 debye
dipolederiv: -0.1471087 -0.2274284 0.0603216 -0.2621216 -0.4392953 0.1439847 0.0807702 0.1511956 -0.0278196 -0.7963821 -0.1088524 -0.0320175 -0.0673402 -0.0534147 0.0121208 -0.0694923 0.0071294 -0.0173158 -0.0978777 -0.0421825 -0.1522236 -0.0311381 0.0193439 -0.1001634 -0.1574605 -0.1094809 -0.4917101 -0.7799111 0.0236922 0.1290889 -0.0824278 -0.5364198 -0.2379194 0.0988414 -0.2916837 -0.7445436 -0.7215919 -0.0258925 -0.0465691 0.0273176 -0.0777921 -0.0118259 0.0371574 0.0162992 -0.1758636 -0.389109 0.0311456 0.2115125 -0.0042557 -0.1689458 -0.0047216 0.4523063 -0.0362633 -0.245013 -1.1799426 -0.2499115 -0.2317938 -0.274491 -0.5067913 -0.0042984 -0.2265883 -0.0188466 -0.4887425 0.7597834 -0.1962098 0.0312947 -0.0402117 -0.1233996 0.0694637 0.1519368 0.0378952 -0.0033918 -0.8789238 0.0001656 0.0272326 -0.0086821 -0.0388234 -0.0771969 0.0781926 -0.077799 -0.2911945 0.9340429 0.0172669 0.1556094 0.1083671 0.0054509 0.1347652 -0.092019 0.1934407 0.7674174 -0.0661529 -0.002075 -0.0758284 -0.0981896 -0.0988364 0.0678803 -0.1400968 0.0424512 0.2580273 0.268993 0.5144586 -0.1277694 0.2679869 0.807951 -0.2875173 -0.086563 -0.3073944 -0.003801 0.0153924 0.0486395 0.021005 0.1364991 0.0177893 -0.0329326 0.0093196 -0.0394994 -0.0600494 1.8985485 0.2670602 0.061511 0.3578843 0.6072238 0.4294717 -0.0347466 0.5034256 0.8836257 -0.5918592 -0.3047058 0.0689213 -0.2341459 -0.2634438 0.059316 0.0147837 0.0639274 -0.0372114 -0.5223351 0.0906489 -0.0799014 0.0134283 -0.0318544 -0.0247068 -0.0484536 -0.0174547 -0.0830586 1.4654851 0.1665284 0.1042655 0.1642105 0.1516849 -0.0966999 0.1354143 -0.0959413 -0.0673652 0.5278923 0.0517485 0.0216123 -0.0667003 0.1615865 -0.1220465 -0.2225445 -0.1541868 0.0905322 0.005435 -0.0128769 -0.0666544 0.0147733 0.1529783 -0.0269876 -0.0645981 -0.0175655 0.0452233 0.0445893 0.0365267 -0.0345331 0.0611057 0.0399725 0.0412854 -0.0387367 0.0523543 0.1241587 0.0616929 0.0307544 -0.0210237 0.0324569 0.0589764 0.0446168 -0.024993 0.0444994 0.134206 0.0497442 -0.0550521 0.0146023 -0.0590439 0.0269857 0.0525372 0.0075905 0.0524939 0.1388603 0.1716458 0.0086809 0.0650142 0.0384837 0.2496439 -0.1092604 0.1074819 -0.0987943 0.1753954 0.1766597 -0.0218207 -0.0368027 0.0622794 0.0831532 -0.0741455 0.0872782 -0.0569434 0.0359583 -0.064652 -0.0609403 0.0116238 -0.1312015 -0.1223547 0.0706609 0.067666 0.0645293 0.1081342 -0.1440583 0.0206314 -0.078498 0.0751567 0.0786309 0.0843197 -0.1224465 0.0922122 -0.0244587 unknown
polarizability: 287.6154831|26.8949983|143.3579054|5.6632077|-9.8910329|132.0902124 unknown
InChI: InChI=1S/C11H8Br2ClN3O/c1-15-11(18)7-5-16-17(10(7)14)9-3-2-6(12)4-8(9)13/h2-5,15H,1H3
charge 0 multiplicity 1
26 atoms
Br 1.37147 -2.650271 0.819714
Br 6.188995 0.475074 0.128413
Cl -0.537257 0.465511 2.242931
O  -3.737987 0.740576 1.651587
N  0.03059 -0.013362 -0.417144
N  -0.533481 -0.237938 -1.687345
N  -4.566644 -0.537217 -0.117947
C  1.454908 0.07357 -0.27258
C  -2.201709 -0.012039 -0.071091
C  -0.950534 0.137978 0.550899
C  -1.874838 -0.239653 -1.450046
C  2.222263 -0.988874 0.265901
C  2.111103 1.246695 -0.709311
C  -3.541622 0.10342 0.571203
C  3.623147 -0.874505 0.391698
C  3.510054 1.377857 -0.601839
C  4.247539 0.312615 -0.044176
C  -5.956919 -0.496546 0.346759
H  -2.550332 -0.367125 -2.295488
H  1.509926 2.054814 -1.136324
H  4.208825 -1.696031 0.81016
H  4.009982 2.288345 -0.940978
H  -4.333383 -1.116234 -0.925279
H  -5.986348 0.145879 1.241325
H  -6.320273 -1.50399 0.622634
H  -6.625176 -0.072254 -0.425178
