program: Gaussian 09
title: 000179065
version: EM64L-G09RevD.01
frameworkgroup: C1[X(C11H9BrFN3O)]
method: RPBEPBE
basis: SDD
operation: Freq
keyword: #p
keyword: freq=noraman
keyword: PBEPBE/SDD
title: #p freq=noraman PBEPBE/SDD
converged: YES YES NO NO
title: Mulliken charges:
elementType: Br F O N N N C C C C C C C C C C C H H H H H H H H H
charge: 0.118629 -0.199141 -0.266443 -0.235267 -0.034207 -0.385448 0.491642 0.265475 -0.281556 -0.415929 -0.322542 -0.334181 0.201920 -0.352062 -0.353233 0.323611 -0.607754 0.266249 0.274648 0.275747 0.262810 0.262796 0.311196 0.227669 0.227101 0.278271
chargesum: 0.00000
title: Mulliken charges with hydrogens summed into heavy atoms:
elementType: Br F O N N N C C C C C C C C C C C
charge: 0.118629 -0.199141 -0.266443 -0.235267 -0.034207 -0.074252 0.491642 0.265475 -0.281556 -0.149679 -0.047894 -0.058434 0.201920 -0.089252 -0.090438 0.323611 0.125286
polarizability: 2.45698264e+02 1.13974840e+01 1.55637653e+02 -4.22375051e+00 9.29047889e+00 8.61519044e+01
1716.lowfreq: -5.1043 -0.0007 -0.0006 -0.0004 3.1560 4.4305 33.1855 37.8128 39.2720
frequency: 33.1508 37.8032 39.2702 65.4009 100.4976 109.0490 125.8306 151.0121 190.2407 213.7934 237.0518 257.5874 289.3974 335.9346 355.6920 401.3083 414.9937 420.8738 475.4438 506.8222 545.2733 560.9527 613.6914 617.5792 639.6238 649.0061 713.0606 743.2984 777.7989 798.9183 810.1533 834.7586 844.8718 923.2013 942.7597 955.1181 962.6745 1002.4246 1031.1879 1084.4587 1108.2460 1121.9586 1134.1647 1157.9572 1166.5111 1193.4603 1204.8064 1237.8701 1292.8270 1323.7272 1378.6390 1385.1288 1392.0206 1415.9812 1418.5880 1453.6149 1487.3297 1499.0396 1503.0091 1532.4239 1605.0430 1608.2962 1615.5667 2978.5727 3057.5865 3110.0360 3169.9195 3172.0600 3187.6073 3191.6166 3211.7548 3562.6239
redmass: 5.5070 6.6579 5.5659 5.7621 5.3287 1.1749 4.2926 6.5532 6.2545 6.1363 9.4342 7.8062 6.7980 5.5064 8.0727 5.9896 3.5051 5.4930 5.6606 4.5743 1.6304 1.9440 7.0773 8.2936 5.4025 9.2698 4.0732 5.7586 4.2278 6.4170 1.2452 1.6085 1.4315 5.5425 1.3709 1.4210 4.9821 3.2346 4.3533 5.3198 1.3169 1.2905 1.6235 1.3800 2.8532 2.0348 2.8547 2.2651 1.2894 5.8630 5.1534 9.0324 6.3351 3.3264 1.2184 1.3569 1.0513 2.3877 2.1303 3.1911 8.0959 7.1916 6.5206 1.0349 1.1024 1.0980 1.0891 1.0893 1.0974 1.0981 1.0973 1.0776
irintensity: 1.4505 8.0003 0.1592 0.6987 1.8535 0.7428 0.2710 0.5677 1.9303 1.9429 0.9241 0.8781 6.5637 23.2776 6.9179 0.8338 0.2031 0.4184 1.4620 17.7334 90.9284 31.4718 23.7780 5.1093 4.9830 5.1781 0.5036 12.5331 12.7891 7.4645 0.1213 86.6408 23.2942 68.3500 3.5216 3.6936 27.3359 9.3764 2.6478 0.2762 9.7569 0.2643 65.1944 55.0924 13.8087 59.7858 21.6832 86.0215 2.5533 28.1361 13.8685 15.6800 50.4996 1.2242 35.1582 106.1894 16.5356 197.5525 70.8736 292.1243 10.4080 139.3440 11.8264 88.0307 36.4536 1.5790 4.5256 2.2126 0.8902 0.1400 1.6350 18.2956
temp: 298.150 k
press: 1.00000 atm
elementType: 35 9 8 7 7 7 6 6 6 6 6 6 6 6 6 6 6 1 1 1 1 1 1 1 1 1
symmnumber: 1
zpe: 482633.1 jmol-1
zpe.correction: 0.183825 hartree
zpe.thermalcorrener: 0.199504 hartree
zpe.thermalcorrenthalpy: 0.200448 hartree
zpe.thermalcorrgfe: 0.138172 hartree
zpe.sumelectzpe: -776.122074 hartree
zpe.sumelectthermal: -776.106395 hartree
zpe.sumelectthermalent: -776.105451 hartree
zpe.sumelectthermalfe: -776.167727 hartree
dipole: -1.3130 -2.4825 1.6995
dipole: 3.2826
quadrupole: -104.4700 -102.3740 -105.5049
quadrupole: 14.8971 -7.9920 5.1546
quadrupole: -0.3537 1.7423 -1.3886 14.8971 -7.9920 5.1546
hfenergy: -776.3058994 hartree
pointgroup: C01 [X(C11H9Br1F1N3O1)]
dipole: -0.5313206 0.7864794 -0.8757907 debye
dipolederiv: 0.0234974 0.09003 -0.0431027 0.0534873 -0.3863942 0.1607118 -0.0041865 0.1469204 0.0367549 -1.3134698 0.0669922 -0.0418714 0.1101534 -0.1972977 -0.0221553 -0.0564848 -0.0175753 -0.1614659 -0.809497 -0.1152276 0.0474135 -0.0917125 -0.6626246 0.2922074 -0.0604659 0.2500065 -0.5867169 -0.9048607 0.1176361 -0.0575357 -0.0356048 -0.2083864 -0.0084273 0.0230073 0.0519288 -0.0072744 -0.2935606 -0.1859848 0.0565742 -0.4265967 -0.2988757 0.0442776 -0.0213684 0.0436605 -0.1862076 -1.1534918 0.2583604 -0.2899615 0.2544691 -0.5172058 0.0355124 -0.3111144 0.0208633 -0.5233002 0.9743842 0.0165586 -0.0011096 -0.1654132 -0.0415005 0.0393618 0.0642769 0.0042562 0.0362032 -0.9270732 -0.0271482 -0.0171735 0.1250236 -0.2732342 0.1258737 -0.0557139 0.1072044 -0.0553407 0.8964923 -0.1121928 0.0542306 0.1012262 0.7497629 -0.3095857 0.1096607 -0.2845532 -0.0087536 -0.191187 0.0603801 -0.03365 0.0339542 0.2210804 -0.0659027 -0.0667868 -0.0834788 -0.0986399 -0.0140054 -0.0214303 0.0081911 0.0690488 0.0061249 0.0684817 -0.0186741 0.0410308 -0.065964 -0.0493797 -0.0049802 0.0259268 -0.0596921 0.0299524 0.0604011 0.0235979 0.0440796 -0.0805593 1.8993152 -0.1325591 0.2775773 -0.0219919 0.7929048 -0.5326826 0.3291726 -0.4670538 0.6969527 -0.2631567 -0.0232402 -0.0038808 -0.1848972 -0.0304996 0.0498004 -0.1246253 0.0506577 -0.129053 -0.2181192 0.0368518 0.0174969 0.202378 -0.0539445 0.060054 0.1193606 0.0482458 -0.1189187 1.3944088 -0.0876641 0.0574074 -0.1049833 0.2328343 0.062686 0.0763209 0.0625247 0.1327155 0.5415917 -0.0511925 0.070817 0.1888119 0.1033457 0.1601233 -0.0710675 0.1336085 0.1369512 0.0260254 0.0604569 -0.0188126 0.0755665 0.0339427 0.0310386 0.0232278 0.0371426 0.1556886 0.0661553 -0.0483226 -0.0493506 -0.069443 0.0477226 -0.055148 -0.0570067 -0.0454408 0.1139046 0.1044431 0.0627287 0.0211278 0.0615085 0.0564494 -0.0596492 0.0406048 -0.0366998 0.1318708 0.049409 0.0422007 0.0169168 0.0640023 0.0379093 -0.0722405 0.0216754 -0.06562 0.1436615 0.03337 -0.0477134 -0.0372053 -0.0551103 0.0560255 -0.0688197 -0.0452871 -0.0639572 0.1406964 0.157396 -0.061485 0.025885 -0.0996511 0.2076563 0.1055799 0.0607086 0.1093948 0.2395497 -0.0737137 -0.0038143 -0.0708485 -0.0675585 0.098728 -0.0813923 -0.1327232 -0.0807797 -0.1097982 -0.1279463 0.0866763 0.0040609 0.1347735 -0.058131 -0.0827487 0.0570777 -0.0773006 0.0954816 0.1729729 0.0240833 -0.0191231 -0.0917489 0.0536549 0.0626421 0.0768136 0.0709343 0.0715617 unknown
polarizability: 246.0456094|-6.6113837|155.629251|9.7985242|-6.2755608|85.8129619 unknown
InChI: InChI=1S/C11H9BrFN3O/c1-14-11(17)9-6-15-16(10(9)12)8-4-2-7(13)3-5-8/h2-6,14H,1H3
charge 0 multiplicity 1
26 atoms
Br -0.633823 -2.378403 0.670213
F  5.74864 -0.261082 0.093863
O  -3.762856 -1.40128 0.793476
N  0.15781 0.31733 -0.154084
N  -0.33357 1.598213 -0.469068
N  -4.452783 0.309939 -0.63482
C  1.582761 0.138852 -0.090169
C  -2.096187 0.124841 -0.105362
C  -0.885792 -0.572352 0.086092
C  -1.68565 1.455883 -0.441857
C  2.200735 -1.002218 -0.653685
C  2.358801 1.160352 0.508456
C  -3.481297 -0.400324 0.064922
C  3.602693 -1.143488 -0.585977
C  3.760504 1.032003 0.569501
C  4.349966 -0.123891 0.027444
C  -5.876203 -0.032328 -0.548817
H  -2.305071 2.331978 -0.630533
H  1.603281 -1.766884 -1.155525
H  1.859041 2.045261 0.909886
H  4.108206 -2.015064 -1.010438
H  4.384666 1.803621 1.028156
H  -4.160123 1.040492 -1.28447
H  -6.269869 -0.373503 -1.524409
H  -6.474768 0.829901 -0.201282
H  -5.973814 -0.854749 0.177687
