program: Gaussian 09
title: 000179064
version: EM64L-G09RevD.01
frameworkgroup: C1[X(C11H8BrF2N3O)]
method: RPBEPBE
basis: SDD
operation: Freq
keyword: #p
keyword: freq=noraman
keyword: PBEPBE/SDD
title: #p freq=noraman PBEPBE/SDD
converged: YES YES NO NO
title: Mulliken charges:
elementType: Br F F O N N N C C C C C C C C C C C H H H H H H H H
charge: 0.110801 -0.163987 -0.190205 -0.268371 -0.236915 -0.024273 -0.387475 0.303746 0.273267 -0.259799 -0.408160 0.250714 -0.238857 0.204380 -0.496828 -0.370505 0.379274 -0.607971 0.259978 0.269915 0.290290 0.268473 0.309188 0.278594 0.227067 0.227659
chargesum: 0.00000
title: Mulliken charges with hydrogens summed into heavy atoms:
elementType: Br F F O N N N C C C C C C C C C C C
charge: 0.110801 -0.163987 -0.190205 -0.268371 -0.236915 -0.024273 -0.078288 0.303746 0.273267 -0.259799 -0.148183 0.250714 0.031059 0.204380 -0.206538 -0.102032 0.379274 0.125349
polarizability: 2.31271372e+02 -1.68239780e+01 1.44563297e+02 -2.19342986e+00 -2.15126975e+00 1.02148223e+02
1716.lowfreq: -0.0008 -0.0005 0.0009 1.4271 4.3844 6.5816 23.1117 28.7128 35.0663
frequency: 22.8409 28.6826 35.0391 45.0508 97.8017 110.9738 117.6534 135.1891 165.8716 213.3318 219.1572 223.8115 257.0065 295.1252 312.0160 338.0365 342.2716 411.0400 441.8352 476.8803 488.4178 524.8571 547.1223 548.2159 606.1432 620.7938 636.7096 648.6661 708.9503 720.8086 744.8465 779.2148 813.7084 842.7364 853.5027 915.8083 939.2168 946.1663 963.4568 1023.1365 1083.2650 1094.5364 1122.2079 1133.4849 1134.3889 1167.2235 1192.7419 1239.3330 1241.7089 1252.0846 1320.5072 1378.1145 1386.9153 1394.0480 1418.0726 1419.1728 1454.2712 1487.9023 1502.1477 1510.2316 1535.1433 1602.8385 1607.7472 1623.1671 2978.4995 3057.3231 3110.6993 3168.0905 3191.6244 3195.6377 3208.8624 3566.7581
redmass: 7.9177 5.0367 8.9457 10.2213 5.9929 1.9681 1.6325 7.8148 5.2581 6.6031 7.5831 8.4777 7.8236 7.4626 11.7137 5.6150 9.2802 6.2890 4.6674 5.3252 6.9182 3.5174 1.4090 7.1888 3.9708 6.7069 5.1736 9.9624 4.7469 4.7250 5.6220 4.1328 1.4313 1.4516 1.6205 5.3548 4.5584 1.3592 6.1617 7.8644 3.8837 2.1659 1.2891 1.5979 1.6168 2.2847 2.1630 2.3621 2.9226 1.9353 5.8870 8.0506 5.5533 5.7971 3.5982 1.2703 1.3538 1.0496 1.8659 3.7556 3.3530 9.0145 7.1557 7.8204 1.0350 1.1024 1.0979 1.0902 1.0969 1.0943 1.0972 1.0775
irintensity: 0.5093 5.7039 4.1779 0.3026 1.9179 0.6595 0.3682 0.9246 0.9634 1.0229 0.1246 1.0263 2.7965 2.8699 5.7491 22.8258 6.1306 0.3457 1.4951 3.4771 8.5855 24.1630 93.9686 4.0310 9.2698 16.3398 7.9815 2.1699 1.7957 1.4465 14.5225 9.0734 23.8301 22.2576 60.2199 28.4487 111.7708 1.2967 23.4409 3.7796 14.5272 18.1333 0.1332 24.5264 62.0069 2.3916 43.4799 110.4369 11.1106 28.0422 27.0390 0.9381 30.3371 13.8779 19.4121 33.9216 99.9336 15.8316 42.2074 186.3654 317.8454 47.1164 144.0821 41.4087 86.7281 36.6959 1.5203 2.1567 0.3938 2.1407 2.1007 16.8112
temp: 298.150 k
press: 1.00000 atm
elementType: 35 9 9 8 7 7 7 6 6 6 6 6 6 6 6 6 6 6 1 1 1 1 1 1 1 1
symmnumber: 1
zpe: 460208.4 jmol-1
zpe.correction: 0.175284 hartree
zpe.thermalcorrener: 0.192002 hartree
zpe.thermalcorrenthalpy: 0.192947 hartree
zpe.thermalcorrgfe: 0.127642 hartree
zpe.sumelectzpe: -875.283935 hartree
zpe.sumelectthermal: -875.267217 hartree
zpe.sumelectthermalent: -875.266272 hartree
zpe.sumelectthermalfe: -875.331577 hartree
dipole: 0.5187 -1.3571 -3.0083
dipole: 3.3408
quadrupole: -101.3886 -112.1337 -109.2385
quadrupole: -16.2597 -7.3247 -1.7706
quadrupole: 6.1984 -4.5468 -1.6516 -16.2597 -7.3247 -1.7706
hfenergy: -875.459219 hartree
pointgroup: C01 [X(C11H8Br1F2N3O1)]
dipole: -0.1878631 0.0251182 -1.3006364 debye
dipolederiv: 0.0199461 0.0933374 -0.0735099 0.0789437 -0.2777092 0.2541015 -0.03733 0.2323869 -0.0790042 -0.342111 0.2219782 0.1465017 0.2162809 -0.6105524 -0.3271371 0.105717 -0.3331003 -0.3261253 -1.2302099 0.1131683 -0.0550602 0.1295776 -0.202718 -0.0263777 -0.0899099 -0.0188403 -0.1694309 -0.8022589 -0.0785545 0.0763787 -0.0760297 -0.5370205 0.2757761 -0.0191267 0.2436254 -0.7046944 -0.710823 0.1360433 -0.0714434 -0.0040669 -0.1641968 0.0207672 0.0513593 0.0545231 -0.0629583 -0.3997198 -0.1485275 0.1061663 -0.3795302 -0.2237726 0.0564555 0.1568026 0.070015 -0.2115706 -1.1562309 0.2081235 -0.3185648 0.1926478 -0.5108175 0.027835 -0.3288495 0.0183559 -0.51351 0.7521801 -0.052389 -0.0342638 -0.1019893 -0.113535 0.0065022 0.1623354 -0.049752 -0.0405824 -0.8857413 -0.0049182 0.0061936 0.0337756 -0.1992513 0.1687391 -0.0175337 0.153371 -0.1266363 0.840088 -0.1397744 0.0822956 0.0943206 0.5408899 -0.4588145 0.0390164 -0.4323751 0.2101995 -0.0860539 0.0446859 -0.0437462 0.0884571 0.1344536 -0.1445381 -0.1228651 -0.1493558 -0.0171005 0.4752309 -0.2199964 -0.1263114 -0.2103352 0.7254847 0.3890258 -0.0187282 0.4008111 0.3888453 0.0914158 -0.0287005 0.0142731 -0.0454035 0.0350881 0.0741701 -0.0695134 0.059472 -0.0159875 1.9019683 -0.1299799 0.2640999 -0.0131586 0.5694837 -0.4948903 0.2598219 -0.4427989 0.8898931 -0.3878492 0.1371836 0.0884802 0.120472 -0.2051248 -0.0161627 0.0582202 -0.0177056 -0.1610026 -0.374145 -0.0431861 -0.0370849 -0.1513508 -0.0819188 0.0242825 -0.1531478 0.0449956 -0.1578587 1.4115466 -0.1463055 0.075773 -0.0944935 0.3394637 0.14555 0.1460105 0.1284481 0.2221366 0.5403822 -0.0393064 0.0680252 0.1553316 0.1644662 0.1463503 -0.1320032 0.132394 0.0725659 0.0170081 0.0571866 -0.0389892 0.0778739 0.0651431 0.0603906 -0.0069002 0.0661275 0.1217126 0.0645175 -0.0435629 -0.0524691 -0.0610094 0.0712709 -0.0485412 -0.0624373 -0.0462245 0.1011326 0.0764917 -0.0147532 -0.0282041 -0.0121051 0.1089118 -0.06636 -0.0308083 -0.0615327 0.1530971 0.0537779 0.0411849 0.0136316 0.0554608 0.0631017 -0.0758567 0.0175556 -0.0713572 0.1373288 0.1579625 -0.046609 0.0446347 -0.0698287 0.2585269 0.1059789 0.0815012 0.1086302 0.1849672 0.1736102 0.0196145 -0.027218 -0.0707854 0.0848003 0.0627686 0.0916057 0.0654325 0.0404442 -0.084509 -0.0213373 -0.0720968 -0.0951559 0.0572992 -0.1127577 -0.116122 -0.1143604 -0.0573094 -0.1164741 0.0853946 -0.0074916 0.1421007 -0.0917667 -0.0472577 0.0353293 -0.0411853 0.1214483 unknown
polarizability: 231.6454189|-12.3314375|139.0264571|10.5138282|-13.7004483|107.3110162 unknown
InChI: InChI=1S/C11H8BrF2N3O/c1-15-11(18)7-5-16-17(10(7)12)9-3-2-6(13)4-8(9)14/h2-5,15H,1H3
charge 0 multiplicity 1
26 atoms
Br -0.707985 -2.117199 1.260285
F  1.660151 1.926712 1.205037
F  5.609101 -0.593903 0.108327
O  -3.850996 -1.14342 1.11313
N  0.051355 0.189484 -0.323823
N  -0.413325 1.309072 -1.039008
N  -4.577905 0.204771 -0.646201
C  1.459682 -0.034108 -0.206111
C  -2.199706 0.074371 -0.18733
C  -1.000563 -0.553488 0.201084
C  -1.767036 1.214738 -0.944931
C  2.262957 0.858368 0.541196
C  2.081768 -1.125793 -0.852507
C  -3.586678 -0.348636 0.158665
C  3.652086 0.69585 0.658546
C  3.472689 -1.330995 -0.748295
C  4.223113 -0.408371 0.003111
C  -6.000929 -0.069067 -0.421695
H  -2.370826 1.997336 -1.403573
H  1.465955 -1.811117 -1.441775
H  4.256657 1.394572 1.241337
H  3.967606 -2.171666 -1.240192
H  -4.307712 0.770909 -1.450743
H  -6.075945 -0.708357 0.472333
H  -6.449774 -0.604284 -1.279191
H  -6.56564 0.865119 -0.245574
