program: Gaussian 09
title: 000179062
version: EM64L-G09RevD.01
frameworkgroup: C1[X(C12H11BrClN3O)]
method: RPBEPBE
basis: SDD
operation: Freq
keyword: #p
keyword: freq=noraman
keyword: PBEPBE/SDD
title: #p freq=noraman PBEPBE/SDD
converged: YES YES NO NO
title: Mulliken charges:
elementType: Br Cl O N N N C C C C C C C C C C C C H H H H H H H H H H H
charge: 0.091219 -0.053564 -0.275784 -0.236952 -0.123579 -0.030237 0.238668 0.503061 -0.269331 0.168458 -0.395650 -0.324371 -0.382878 -0.608220 -0.618981 -0.071431 -0.185663 -0.247842 0.287337 0.288834 0.280759 0.225187 0.282119 0.224488 0.231755 0.259983 0.240752 0.240132 0.261731
chargesum: 0.00000
title: Mulliken charges with hydrogens summed into heavy atoms:
elementType: Br Cl O N N N C C C C C C C C C C C C
charge: 0.091219 -0.053564 -0.275784 -0.236952 -0.123579 -0.030237 0.238668 0.503061 -0.269331 0.168458 -0.108313 -0.035537 -0.102120 0.123574 0.113509 -0.071431 0.054469 0.013889
polarizability: 2.55377356e+02 3.88304735e+00 1.93578501e+02 6.91136859e+00 -7.18243975e+00 1.00611923e+02
1716.lowfreq: -9.5899 -4.9598 -3.2014 -0.0019 -0.0012 -0.0005 25.2881 32.9280 51.2091
frequency: 25.0835 32.9173 51.1801 53.4719 71.6534 111.0896 119.7698 137.4800 153.4366 164.4012 186.9732 195.7583 232.7833 259.3300 272.3689 318.6690 339.1653 365.6767 371.4050 384.9783 433.0712 446.7318 468.0531 517.6112 574.6196 626.9496 637.6702 651.9048 681.1498 688.9866 732.4648 751.8607 788.7138 857.2020 878.9987 885.8929 906.8315 933.6365 979.1085 983.6549 1004.2632 1046.2002 1051.3664 1072.8405 1092.3384 1093.7036 1116.0809 1144.3381 1170.9185 1176.5657 1203.2191 1240.9260 1285.1601 1317.5607 1367.0206 1376.9524 1381.9008 1395.7778 1411.2877 1428.3691 1439.0306 1466.9512 1469.8427 1477.1911 1486.4942 1492.7104 1530.0721 1566.4503 1583.2082 1606.7028 2965.3882 2971.6979 3036.2168 3045.5427 3120.1792 3121.7123 3152.2108 3176.1402 3187.6873 3190.8785 3235.7234
redmass: 9.5104 5.2546 5.0128 7.2569 7.0333 1.6850 3.4357 1.9217 1.8852 3.0199 5.6483 5.8871 5.6005 2.8054 6.2197 4.3736 5.6233 6.8148 5.2243 4.7470 3.8899 4.4460 5.0668 6.1894 6.1240 9.5184 5.2311 7.0780 2.8370 4.5495 6.2395 7.9924 1.4024 1.4593 1.5133 4.2613 1.4236 5.7077 1.3565 5.9051 3.8149 5.4064 1.4205 1.9331 1.5959 1.2266 2.3217 1.3878 3.6921 1.1002 1.7896 6.2569 1.3071 5.2735 4.0583 7.0443 8.6055 3.0028 1.1879 2.5577 1.3212 1.0535 1.0602 2.8962 1.0554 1.4178 4.4118 6.1371 7.2313 6.8082 1.0369 1.0365 1.1013 1.1014 1.0956 1.0974 1.0882 1.0947 1.0935 1.0970 1.0983
irintensity: 2.5699 3.4466 0.6411 1.9765 0.0832 0.1680 2.5292 0.3652 0.2990 1.5865 0.5964 0.5088 1.0804 2.7663 5.8288 4.9160 3.2491 4.1377 11.1658 6.9766 3.5615 5.3812 2.9745 3.1641 2.2890 2.2780 10.2809 0.6702 20.5626 16.1571 13.6986 54.3689 53.0255 21.3713 21.4029 15.3070 1.8227 53.3618 1.8185 6.4610 32.5639 51.1097 3.0362 17.0384 7.8701 1.6134 111.0742 2.1987 10.2607 1.2123 23.3058 33.8203 1.7158 3.2611 86.1277 55.3111 11.7763 58.5822 47.8383 11.4054 18.3032 8.6873 17.9981 120.4561 22.8297 7.0682 145.6572 259.2890 64.2530 82.2479 30.3748 105.0468 39.3217 27.6963 12.9469 1.4067 8.3943 3.6233 0.5059 1.1135 0.4507
temp: 298.150 k
press: 1.00000 atm
elementType: 35 17 8 7 7 7 6 6 6 6 6 6 6 6 6 6 6 6 1 1 1 1 1 1 1 1 1 1 1
symmnumber: 1
zpe: 550111.9 jmol-1
zpe.correction: 0.209527 hartree
zpe.thermalcorrener: 0.227144 hartree
zpe.thermalcorrenthalpy: 0.228088 hartree
zpe.thermalcorrgfe: 0.161289 hartree
zpe.sumelectzpe: -1175.553557 hartree
zpe.sumelectthermal: -1175.535940 hartree
zpe.sumelectthermalent: -1175.534996 hartree
zpe.sumelectthermalfe: -1175.601795 hartree
dipole: -0.6533 -2.2097 1.6077
dipole: 2.8097
quadrupole: -115.4827 -119.5717 -122.8558
quadrupole: -20.9349 14.2433 -1.0397
quadrupole: 3.8207 -0.2683 -3.5524 -20.9349 14.2433 -1.0397
hfenergy: -1175.7630839 hartree
pointgroup: C01 [X(C12H11Br1Cl1N3O1)]
dipole: -0.1783351 0.822907 -0.7162218 debye
polarizability: 254.8796416|-8.0122406|192.3423078|-1.9430523|-15.3630565|102.3458309 unknown
InChI: InChI=1S/C12H11BrClN3O/c1-16(2)12(18)10-7-15-17(11(10)13)9-5-3-4-8(14)6-9/h3-7H,1-2H3
charge 0 multiplicity 1
29 atoms
Br 0.602366 1.83725 0.797162
Cl -4.394373 2.552196 -1.031738
O  3.938907 -1.192088 0.976148
N  -0.41911 -0.763555 -0.137117
N  3.877393 0.648197 -0.460013
N  -0.017166 -2.074125 -0.458538
C  1.846956 -0.735578 -0.096429
C  -1.824613 -0.485943 -0.066096
C  0.693431 0.047757 0.090535
C  3.288975 -0.439245 0.178284
C  1.340486 -2.034484 -0.418495
C  -2.341144 0.745474 -0.53327
C  -2.686517 -1.489877 0.437353
C  5.261904 1.007888 -0.109101
C  3.27604 1.412116 -1.562683
C  -3.727825 0.960505 -0.443341
C  -4.07298 -1.243419 0.495587
C  -4.612881 -0.008826 0.064027
H  1.916249 -2.935739 -0.617411
H  -1.69194 1.506739 -0.969807
H  -2.261926 -2.441827 0.764285
H  5.316843 2.075156 0.177549
H  5.582986 0.377748 0.73362
H  5.942014 0.835923 -0.96593
H  3.965463 1.417662 -2.429418
H  2.327123 0.955192 -1.878969
H  3.082204 2.460826 -1.266227
H  -4.744178 -2.014704 0.886371
H  -5.686886 0.189284 0.11676
