program: Gaussian 09
title: 000179061
version: EM64L-G09RevD.01
frameworkgroup: C1[X(C11H8Cl3N3O)]
method: RPBEPBE
basis: SDD
operation: Freq
keyword: #p
keyword: freq=noraman
keyword: PBEPBE/SDD
title: #p freq=noraman PBEPBE/SDD
converged: YES YES NO NO
title: Mulliken charges:
elementType: Cl Cl Cl O N N N C C C C C C C C C C C H H H H H H H H
charge: 0.080150 0.001928 -0.031014 -0.267934 -0.233375 -0.033410 -0.386801 0.651302 0.302222 -0.255510 -0.416388 -0.334687 -0.313509 0.200203 -0.087763 -0.184330 -0.213687 -0.608004 0.264719 0.288535 0.265559 0.267308 0.310919 0.278485 0.227948 0.227137
chargesum: 0.00000
title: Mulliken charges with hydrogens summed into heavy atoms:
elementType: Cl Cl Cl O N N N C C C C C C C C C C C
charge: 0.080150 0.001928 -0.031014 -0.267934 -0.233375 -0.033410 -0.075882 0.651302 0.302222 -0.255510 -0.151669 -0.334687 -0.024974 0.200203 -0.087763 0.081229 0.053621 0.125566
polarizability: 2.48617345e+02 7.60768926e+00 1.51310390e+02 -1.55110422e+01 8.34584314e+00 1.19471646e+02
1716.lowfreq: -7.3797 0.0013 0.0024 0.0026 3.5281 5.6058 24.1562 30.5719 41.4169
frequency: 24.0006 30.5339 41.4120 63.9741 93.8610 107.2085 111.0105 115.5890 158.2239 169.5434 188.8523 234.5376 267.6980 281.8345 291.8316 303.5790 314.9068 346.1192 409.3685 443.8226 465.7477 484.6196 538.2226 544.5461 555.0471 596.7195 638.0403 645.8093 664.2263 712.2134 746.2452 764.7797 789.5065 815.9046 844.1485 887.9991 932.6495 951.0606 974.0887 1010.2160 1062.5057 1079.9657 1099.8708 1122.0131 1134.9171 1138.6726 1175.0555 1210.0763 1237.4457 1247.3154 1320.7588 1342.5451 1368.5185 1394.7349 1420.1453 1421.8256 1453.5371 1472.1657 1488.1744 1507.4242 1542.5893 1571.6183 1594.9716 1610.1447 2978.6202 3057.5807 3110.8293 3167.3706 3182.6168 3186.0058 3209.9225 3563.2201
redmass: 8.0187 7.7797 7.7800 5.9198 10.3392 3.3855 1.2912 5.3982 12.0027 5.9071 7.9965 6.5303 8.0252 8.8105 6.2071 7.5217 12.3579 5.0438 8.1829 4.2757 6.8356 5.2944 4.1506 7.3681 1.3922 5.0633 5.5750 10.9647 6.9243 4.1579 5.5958 6.0138 5.2547 1.3437 1.4434 1.5116 5.3306 1.3509 6.3383 6.9976 7.0110 1.9544 5.3278 1.2924 1.6095 1.3999 2.0038 3.2803 2.3242 1.3631 5.4743 3.4912 9.4839 5.4786 1.2830 2.9560 1.3855 3.5805 1.0491 1.6329 4.7244 7.5260 8.1914 7.1818 1.0350 1.1024 1.0979 1.0891 1.0939 1.0977 1.0973 1.0776
irintensity: 2.9611 0.5169 6.1794 1.9925 0.4391 0.2329 0.4899 1.0377 0.5473 0.7027 0.4239 2.1027 2.3406 1.1934 4.9265 3.8915 2.4441 18.4666 4.3277 5.4119 2.4046 13.8803 19.8479 50.4696 84.4330 3.3576 1.0511 0.4267 3.8514 0.7738 17.2461 9.2110 35.0026 39.8680 20.0437 23.0283 42.1464 0.4112 47.1788 46.1520 8.9228 38.2733 4.7379 0.1663 57.9347 9.6471 18.5501 16.9470 91.0349 1.1562 34.9869 5.3847 0.6301 40.2155 27.9915 45.7262 143.1985 89.4309 15.6105 20.4634 337.3512 6.4328 36.1874 148.9643 85.2957 35.8720 1.5323 0.1700 0.9947 0.8515 1.3229 17.6636
temp: 298.150 k
press: 1.00000 atm
elementType: 17 17 17 8 7 7 7 6 6 6 6 6 6 6 6 6 6 6 1 1 1 1 1 1 1 1
symmnumber: 1
zpe: 454777.5 jmol-1
zpe.correction: 0.173216 hartree
zpe.thermalcorrener: 0.190439 hartree
zpe.thermalcorrenthalpy: 0.191383 hartree
zpe.thermalcorrgfe: 0.125304 hartree
zpe.sumelectzpe: -2042.322981 hartree
zpe.sumelectthermal: -2042.305758 hartree
zpe.sumelectthermalent: -2042.304814 hartree
zpe.sumelectthermalfe: -2042.370893 hartree
dipole: -0.3420 0.4572 -2.8600
dipole: 2.9164
quadrupole: -103.3386 -122.1022 -130.5062
quadrupole: -11.6940 -18.0012 1.8218
quadrupole: 15.3104 -3.4532 -11.8572 -11.6940 -18.0012 1.8218
hfenergy: -2042.4961965 hartree
pointgroup: C01 [X(C11H8Cl3N3O1)]
dipole: -0.1387998 0.7221942 -0.880757 debye
dipolederiv: -0.0787263 -0.0126728 0.1352404 0.0018219 0.0458927 0.0212645 0.1297457 0.0339713 -0.5220166 -0.2530898 -0.2725476 -0.0685215 -0.260495 -0.4988055 -0.1476158 -0.0738948 -0.1424313 -0.0625631 -0.4059031 -0.2999118 -0.1049011 -0.3990868 -0.514232 -0.1738258 -0.1343193 -0.1772516 -0.1169716 -0.7867189 0.026338 -0.1235423 -0.0595516 -0.455445 0.2068031 -0.0609395 0.2438235 -0.8114108 -0.8481531 -0.0087341 0.063954 0.0689125 -0.0723673 -0.0115466 -0.0028368 -0.0430918 -0.1898963 -0.3762902 0.0195271 -0.2127427 -0.0927403 -0.1644342 0.0215765 -0.4526066 0.0376899 -0.2209673 -1.1712759 -0.1753289 0.294671 -0.1800897 -0.4779279 -0.006458 0.3001808 0.010179 -0.5208887 0.8969988 -0.1432311 -0.0391975 -0.0713254 0.0553997 -0.0211118 -0.1712521 0.0278331 0.0229983 -0.8743935 0.0279335 -0.0006485 0.0461077 -0.0251653 0.041177 -0.0001056 0.0513487 -0.3088484 0.9641041 -0.0366532 -0.1519817 0.053669 -0.0303788 -0.0307413 0.0620999 -0.0754834 0.8168609 -0.0878007 -0.0087428 0.0888715 -0.0696927 -0.1038029 -0.0168249 0.1347479 -0.0003999 0.2619066 0.2012034 0.5066147 0.1285758 0.3292121 0.68799 0.2191298 0.1359373 0.223594 -0.0015678 -0.2841494 -0.1214139 -0.0652134 -0.1054936 -0.1886666 -0.0475401 -0.0941117 -0.0375387 -0.0600377 1.9064516 0.1568658 -0.1638196 0.2143404 0.4380122 -0.3649946 -0.1075836 -0.4338811 1.0335094 0.5077071 0.5454863 0.1932846 0.6409065 0.7357146 0.3066282 0.2059319 0.308478 0.0582418 -0.078083 -0.137924 -0.052784 -0.1003756 -0.1272141 0.009138 -0.0156882 0.0082445 -0.0647398 -0.0647027 -0.097551 -0.0607121 -0.1138083 -0.1588039 -0.018793 -0.0633998 -0.0203035 -0.099472 0.5329565 0.0341978 -0.0430122 -0.0503841 0.2027815 0.1089407 0.2142787 0.1216469 0.0411792 0.0198676 0.0031703 0.067776 0.0413906 0.1570893 0.0026556 0.0628356 -0.0038996 0.0352706 0.1078503 0.0196637 0.0232358 0.0525605 0.0659955 -0.033167 0.0289154 -0.0472289 0.1329091 0.061159 0.0179271 0.0160686 0.0323436 0.0230454 -0.0639296 0.0260646 -0.0640003 0.1318002 -0.0223984 -0.0085461 0.0183914 -0.0141636 0.1057619 -0.0238065 0.0125326 -0.0306529 0.1508135 0.1631205 0.0151106 -0.0576279 0.0353254 0.2820544 0.0964974 -0.105373 0.0893339 0.1526032 0.1750936 -0.0174839 0.0372862 0.0445972 0.1004067 0.0581192 -0.0995911 0.0541818 0.0198811 -0.082576 -0.0706105 0.0053195 -0.1449123 -0.1225066 -0.0252695 -0.0380165 -0.0199707 0.1251279 -0.1222512 0.0385169 0.0720298 0.1009315 0.0396061 -0.1063057 0.1064481 -0.1141909 -0.0037216 unknown
polarizability: 246.0632263|23.2390643|138.8877412|-3.0742656|18.7461356|134.4484136 unknown
InChI: InChI=1S/C11H8Cl3N3O/c1-15-11(18)7-5-16-17(10(7)14)9-4-6(12)2-3-8(9)13/h2-5,15H,1H3
charge 0 multiplicity 1
26 atoms
Cl 0.574248 -0.052554 2.344101
Cl -1.217439 2.759388 0.906562
Cl -4.722462 -2.323252 -0.858972
O  3.701431 -0.615041 1.638785
N  -0.13033 0.108854 -0.324368
N  0.367627 0.095707 -1.642331
N  4.50208 0.303132 -0.352611
C  -1.545673 0.160527 -0.107747
C  2.11355 -0.015626 -0.098035
C  0.896954 0.023084 0.604301
C  1.717272 0.03054 -1.477001
C  -2.179134 1.29307 0.458448
C  -2.32823 -0.944817 -0.514876
C  3.480876 -0.138758 0.482846
C  -3.720438 -0.903393 -0.330786
C  -3.574737 1.314161 0.65036
C  -4.357863 0.208549 0.254746
C  5.912893 0.223701 0.039766
H  2.345698 -0.019243 -2.365829
H  -1.83543 -1.808501 -0.968366
H  -4.0499 2.19433 1.091771
H  -5.442076 0.220701 0.3943
H  4.259357 0.767052 -1.228515
H  5.953649 -0.275288 1.021124
H  6.362926 1.229439 0.134984
H  6.49915 -0.364962 -0.689757
