program: Gaussian 09
title: 000179060
version: EM64L-G09RevD.01
frameworkgroup: C1[X(C11H9BrClN3O)]
method: RPBEPBE
basis: SDD
operation: Freq
keyword: #p
keyword: freq=noraman
keyword: PBEPBE/SDD
title: #p freq=noraman PBEPBE/SDD
converged: YES YES NO NO
title: Mulliken charges:
elementType: Br Cl O N N N C C C C C C C C C C C H H H H H H H H H
charge: 0.124959 -0.050621 -0.264980 -0.236419 -0.032115 -0.384903 0.510926 0.263780 -0.282062 -0.416116 -0.329787 -0.380028 0.201662 -0.072378 -0.186753 -0.245131 -0.607661 0.268318 0.295842 0.276373 0.239754 0.262026 0.311803 0.228099 0.227141 0.278269
chargesum: 0.00000
title: Mulliken charges with hydrogens summed into heavy atoms:
elementType: Br Cl O N N N C C C C C C C C C C C
charge: 0.124959 -0.050621 -0.264980 -0.236419 -0.032115 -0.073100 0.510926 0.263780 -0.282062 -0.147798 -0.033945 -0.103655 0.201662 -0.072378 0.053001 0.016896 0.125849
polarizability: 2.55037062e+02 1.06979307e+01 1.71500998e+02 1.03792325e+01 -6.42309082e+00 9.20826519e+01
1716.lowfreq: -3.9271 -2.9594 0.0017 0.0019 0.0021 4.3789 25.3499 36.7754 42.2537
frequency: 25.3437 36.7642 42.2439 57.6533 94.2362 101.5490 121.7686 165.3604 180.1727 187.2013 228.7171 242.3935 270.9281 283.9908 333.4087 347.2818 379.1247 433.4338 448.1320 485.3539 521.0202 553.1499 585.9563 636.4289 640.1331 660.4608 683.7432 740.7340 746.2623 783.2685 788.9957 846.5220 882.0100 906.3403 927.7741 964.1063 978.3179 984.3393 1042.8201 1073.0316 1085.4209 1092.9937 1121.6290 1134.5084 1166.5094 1176.3688 1196.1893 1237.0494 1284.7933 1324.6392 1372.3874 1382.3218 1392.4628 1419.2715 1427.0122 1452.5420 1476.0442 1486.8466 1502.1921 1532.2145 1583.7650 1605.0616 1610.5197 2978.6442 3057.5524 3110.6307 3152.8171 3178.0029 3188.7071 3191.5566 3212.4992 3561.9169
redmass: 7.9007 5.6651 5.6117 9.0735 1.2938 3.7304 4.6517 5.5595 6.9950 5.1801 7.4075 6.2448 6.8294 6.6804 4.6190 7.0209 10.7512 3.9871 4.7384 7.5642 5.8310 1.2249 4.6821 9.8862 5.5690 7.6225 2.3219 6.3415 6.8666 4.2789 1.4210 1.4257 1.4330 1.4380 5.1164 5.6931 1.3679 5.9123 7.2540 2.0248 4.0651 1.7133 1.2910 1.6157 2.7085 1.0797 2.4278 2.2293 1.3133 5.7024 4.0888 9.4564 6.0997 1.1927 2.8447 1.3730 2.9117 1.0571 1.7518 3.4169 7.1896 6.9931 7.0664 1.0350 1.1024 1.0979 1.0882 1.0941 1.0958 1.0953 1.0973 1.0776
irintensity: 1.3619 7.4245 1.5247 0.2908 0.5031 1.7368 0.2392 1.3100 1.4407 0.7174 1.4227 1.9145 0.1966 7.0095 20.9350 3.1970 2.8282 4.1576 4.7055 2.1541 17.2099 98.8634 5.5887 6.9446 1.3352 3.6454 25.1910 25.3423 34.0623 29.1679 50.7720 23.3971 17.2403 2.2549 58.5295 38.9342 1.4947 4.2987 23.0392 16.7336 1.4961 8.0387 0.2740 64.9794 25.4908 0.4896 14.6067 83.4369 1.1163 32.2908 41.4928 0.1307 59.7260 38.2522 21.0005 119.7689 99.8380 16.9738 14.2841 313.7494 61.9068 108.4629 109.9357 87.7018 35.9939 1.5645 8.3548 3.0318 0.9214 1.5484 1.4560 18.9339
temp: 298.150 k
press: 1.00000 atm
elementType: 35 17 8 7 7 7 6 6 6 6 6 6 6 6 6 6 6 1 1 1 1 1 1 1 1 1
symmnumber: 1
zpe: 479137.5 jmol-1
zpe.correction: 0.182494 hartree
zpe.thermalcorrener: 0.198593 hartree
zpe.thermalcorrenthalpy: 0.199537 hartree
zpe.thermalcorrgfe: 0.135851 hartree
zpe.sumelectzpe: -1136.341026 hartree
zpe.sumelectthermal: -1136.324928 hartree
zpe.sumelectthermalent: -1136.323983 hartree
zpe.sumelectthermalfe: -1136.387669 hartree
dipole: 0.6254 3.4015 1.2647
dipole: 3.6825
quadrupole: -97.1753 -112.5993 -115.1690
quadrupole: 5.9486 16.0338 -3.4491
quadrupole: 11.1393 -4.2848 -6.8545 5.9486 16.0338 -3.4491
hfenergy: -1136.52352 hartree
pointgroup: C01 [X(C11H9Br1Cl1N3O1)]
dipole: -0.2085771 -1.2274641 0.7408801 debye
dipolederiv: 0.0167567 -0.1017958 0.0641985 -0.060613 -0.322302 0.2045436 0.0193451 0.1909852 -0.0047369 -0.3648067 -0.255168 -0.0805003 -0.3819244 -0.5434301 -0.1636322 -0.1202358 -0.1499986 -0.1177716 -0.7978697 0.1173078 -0.0470276 0.1217129 -0.5863822 0.2960956 0.0689273 0.2410593 -0.6714416 -1.0496973 -0.080127 0.0784029 0.0552017 -0.2131044 0.0118944 0.0116383 0.0781976 -0.023404 -0.2331438 0.1737941 -0.0751257 0.4704266 -0.3055669 0.058968 -0.0359908 0.0480653 -0.1971953 -1.1626962 -0.1818657 0.3375008 -0.160702 -0.4856973 0.0191671 0.3605414 0.0056611 -0.5449862 1.1706511 -0.0573326 -0.0015905 0.1206496 0.1346922 0.1023963 -0.0882437 0.0810054 0.0783553 -0.9317317 0.0470006 0.034713 -0.0961139 -0.2397522 0.1504787 0.0964506 0.1274901 -0.0907177 0.9266027 0.1065631 -0.0999618 -0.1755556 0.6450576 -0.3915323 -0.1314652 -0.3565628 0.0797995 -0.2127891 -0.0453788 0.032485 0.0146641 0.210665 -0.1060012 0.0660229 -0.1233938 -0.0740192 -0.3434366 -0.1458882 -0.0503716 -0.2301631 -0.215727 -0.037716 0.0028247 -0.0564476 -0.0888019 -0.2744213 0.0735018 0.0044582 0.1156062 -0.0519148 0.0157942 -0.0136813 -0.0052881 -0.1274487 1.8831407 0.0246163 -0.3396951 -0.121628 0.6344105 -0.5095927 -0.3872798 -0.4366569 0.8667214 0.5053097 0.4464812 0.1152827 0.6269297 0.8233409 0.2993916 0.1984093 0.2648288 0.0380943 0.131306 -0.016511 -0.0151969 -0.0469634 0.1015354 0.0831833 -0.0632527 0.0728455 -0.1044434 -0.1291609 -0.0647463 -0.0408014 -0.142431 -0.2770561 -0.064813 -0.0571993 -0.0540137 -0.1330494 0.5320377 0.0222662 -0.0763889 -0.1983681 0.1551167 0.1658715 0.0950168 0.1254321 0.0917224 0.019408 -0.0554888 0.0296017 -0.07351 0.0534792 0.0439213 -0.0098061 0.0516771 0.1448243 0.1042583 0.0351202 0.0307932 0.0605567 0.0505194 -0.0382364 0.0384718 -0.0277921 0.1396486 0.0960115 -0.0720122 -0.0143412 -0.072035 0.0495636 -0.0467158 -0.0327424 -0.0218812 0.1512736 0.0189829 0.059882 0.0290495 0.0694908 -0.0302952 -0.0690371 0.0397383 -0.0649071 0.1306679 -0.0401851 -0.0055842 0.0145019 -0.0219461 0.1102058 -0.0194705 0.0187618 -0.0139053 0.1639331 0.1660803 0.0663925 -0.025649 0.0984332 0.2319639 0.1038231 -0.0690638 0.1091709 0.2084482 -0.0619032 0.0183231 0.0605127 0.0929014 0.0635442 -0.1149843 0.1131398 -0.115074 -0.0842494 -0.1434332 -0.084866 0.0112963 -0.1388012 -0.0640267 -0.0529577 -0.0322677 -0.0461206 0.1168545 0.174729 -0.0244844 0.0238538 0.0741819 0.0711606 0.0591605 -0.0880597 0.0756233 0.0519222 unknown
polarizability: 254.5446826|11.9367426|171.8167395|-9.5299305|-9.2248545|92.2592898 unknown
InChI: InChI=1S/C11H9BrClN3O/c1-14-11(17)9-6-15-16(10(9)12)8-4-2-3-7(13)5-8/h2-6,14H,1H3
charge 0 multiplicity 1
26 atoms
Br -0.429206 2.173828 -0.994592
Cl 4.64623 2.324948 0.750451
O  -3.614385 1.358168 -0.971219
N  0.225129 -0.450237 0.136243
N  -0.335425 -1.650323 0.61416
N  -4.356147 -0.074801 0.714788
C  1.656059 -0.376372 0.028055
C  -2.01292 -0.121836 0.105636
C  -0.768783 0.47027 -0.189903
C  -1.67566 -1.425412 0.59667
C  2.347124 0.800308 0.400703
C  2.35756 -1.523269 -0.413217
C  -3.368902 0.46129 -0.10724
C  3.748246 0.810364 0.281137
C  3.763367 -1.478779 -0.506631
C  4.478044 -0.305778 -0.168674
C  -5.758792 0.341916 0.615346
H  -2.343329 -2.230011 0.902528
H  1.818004 1.672428 0.789012
H  1.798319 -2.426984 -0.666321
H  4.311954 -2.3612 -0.85077
H  5.567596 -0.263776 -0.248218
H  -4.083957 -0.71483 1.461657
H  -6.095425 0.851802 1.537203
H  -6.420035 -0.522536 0.420698
H  -5.833566 1.049524 -0.225703
