program: Gaussian 09
title: 000179047
version: EM64L-G09RevD.01
frameworkgroup: C1[X(C13H26BrN)]
method: RPBEPBE
basis: SDD
operation: Freq
keyword: #p
keyword: freq=noraman
keyword: PBEPBE/SDD
title: #p freq=noraman PBEPBE/SDD
converged: NO YES NO NO
title: Mulliken charges:
elementType: Br N C C C C C C C C C C C C C H H H H H H H H H H H H H H H H H H H H H H H H H H
charge: -0.051559 -0.100230 0.376511 -0.442248 -0.429267 -0.016385 -0.427329 -0.389895 -0.752703 -0.745856 -0.342044 -0.764732 -0.403064 -0.342255 -0.680520 0.196157 0.186988 0.195883 0.195008 0.196623 0.184041 0.215323 0.176685 0.208049 0.216422 0.208293 0.208892 0.240433 0.203811 0.195331 0.178820 0.202920 0.213485 0.219265 0.215402 0.226737 0.206541 0.221775 0.236232 0.273479 0.288982
chargesum: 0.00000
title: Mulliken charges with hydrogens summed into heavy atoms:
elementType: Br N C C C C C C C C C C C C C
charge: -0.051559 -0.100230 0.376511 -0.059104 -0.038376 0.180239 -0.027966 -0.005161 -0.119096 -0.106282 0.039696 -0.116580 0.030214 0.115752 -0.118059
polarizability: 2.18395321e+02 -4.51135194e+00 1.53242435e+02 1.89068444e-01 -8.49152114e-01 1.28090172e+02
1716.lowfreq: -13.3163 -6.4376 -0.0005 -0.0005 -0.0001 6.8105 18.2576 27.4611 49.7403
frequency: 17.0641 26.5728 49.7222 73.9911 80.8235 87.3750 141.3212 167.4548 180.9265 193.0872 214.1334 219.5554 235.2348 243.5277 260.5837 268.2176 292.0412 329.3231 342.5090 351.6921 387.6938 409.6818 419.3979 446.1105 470.5200 537.2428 586.8708 621.6002 712.5897 748.8695 777.9667 789.1571 831.8741 854.1259 878.8297 901.0865 905.5204 916.0111 929.0767 931.6064 944.0884 952.5448 987.0892 995.9559 1033.6158 1051.2118 1069.7732 1075.1382 1079.3828 1085.0039 1113.8319 1120.3716 1146.8051 1154.6605 1187.6764 1190.7330 1212.2724 1215.9321 1239.7891 1248.3053 1268.6473 1272.8386 1279.9454 1290.5461 1306.7914 1314.6676 1321.1949 1327.1668 1329.5656 1335.4085 1346.6553 1354.9055 1364.7876 1379.3439 1380.2815 1390.6601 1394.1086 1449.7401 1450.5209 1454.8441 1458.8677 1463.5577 1466.2879 1470.4062 1473.6049 1474.3883 1476.2065 1477.3667 1477.9043 1485.7601 1492.8906 2812.2825 2818.7827 2896.8425 2945.2241 2955.7655 2960.2648 2965.9693 2967.4417 2974.1381 2979.9936 2995.8288 2997.5965 3000.5878 3006.9279 3015.7531 3032.6730 3045.7212 3052.9685 3053.4385 3054.9795 3058.3406 3060.3939 3063.4376 3070.7562 3084.4814 3140.1066
redmass: 4.2591 3.3132 2.7235 3.7239 2.9657 2.7865 2.9221 2.6026 1.4164 1.8058 1.7506 2.2341 1.1880 1.1922 2.1745 2.7593 2.3107 2.6756 2.6302 3.0869 2.1490 2.4261 2.1896 2.3147 2.5455 2.6874 3.2200 2.9464 3.0169 1.2723 1.7493 1.4106 2.6945 2.2319 1.9658 1.6326 1.6728 2.0099 1.4420 1.6467 1.5765 1.6418 1.6430 1.4510 1.6103 2.4951 1.8283 2.6188 2.5196 1.9289 2.3890 1.6152 1.5716 1.9120 1.8712 2.0187 1.8234 1.4765 1.2556 2.0684 1.3730 1.3092 1.4562 1.2428 1.3789 1.2172 1.3170 1.4041 1.3734 1.3459 1.4408 1.4175 1.2223 1.2897 1.2866 1.2590 1.3124 1.1002 1.0647 1.0730 1.0794 1.0801 1.0623 1.0851 1.0700 1.0889 1.0572 1.0576 1.0579 1.0873 1.0611 1.0716 1.0696 1.0677 1.0612 1.0805 1.0360 1.0367 1.0379 1.0623 1.0623 1.0853 1.0628 1.0918 1.0955 1.0866 1.1001 1.0979 1.0611 1.0985 1.0986 1.0992 1.1007 1.0986 1.0993 1.0981 1.1105
irintensity: 0.2650 0.1736 0.8900 0.3525 1.1898 0.0736 0.5077 0.5155 0.4256 2.7891 0.1480 0.8910 0.1475 0.4365 0.0779 1.7360 0.3075 0.9628 4.9858 3.1979 1.5460 4.4789 3.4552 0.5082 4.0934 4.9553 17.9948 30.4213 1.3335 12.3907 2.5383 1.3724 10.8322 0.6916 2.2790 8.0909 12.8894 5.9006 3.9488 1.8635 2.5730 1.4990 9.3365 8.2038 2.3975 0.8725 42.2714 5.7988 7.7195 3.1993 54.0176 31.4189 2.4590 11.3200 9.0469 2.4779 1.3051 24.2059 28.4287 5.9085 7.8344 1.6334 0.3100 1.1011 1.2758 3.0449 6.3854 3.6400 2.8906 9.8957 6.2314 6.6629 23.9883 12.1982 11.8825 15.7206 1.4409 2.8738 1.2621 2.6323 12.7988 0.7535 2.9710 2.1836 3.7102 11.2903 12.9210 12.3813 15.1730 16.1299 21.8373 55.2126 230.8725 68.9233 32.9310 13.9294 54.0368 29.5385 37.7998 44.3741 10.3457 55.7187 12.2783 23.1769 40.2727 28.1636 41.2381 24.4489 22.3817 27.0717 42.8297 49.4744 45.0645 72.3921 54.1497 30.0239 15.3806
temp: 298.150 k
press: 1.00000 atm
elementType: 35 7 6 6 6 6 6 6 6 6 6 6 6 6 6 1 1 1 1 1 1 1 1 1 1 1 1 1 1 1 1 1 1 1 1 1 1 1 1 1 1
symmnumber: 1
zpe: 964044.9 jmol-1
zpe.correction: 0.367185 hartree
zpe.thermalcorrener: 0.385468 hartree
zpe.thermalcorrenthalpy: 0.386412 hartree
zpe.thermalcorrgfe: 0.318805 hartree
zpe.sumelectzpe: -577.930763 hartree
zpe.sumelectthermal: -577.912481 hartree
zpe.sumelectthermalent: -577.911536 hartree
zpe.sumelectthermalfe: -577.979143 hartree
dipole: -2.9262 0.7444 -0.5487
dipole: 3.0689
quadrupole: -124.2763 -104.6118 -105.5694
quadrupole: 0.8671 1.6401 0.1599
quadrupole: -12.7905 6.8741 5.9164 0.8671 1.6401 0.1599
hfenergy: -578.2979484 hartree
pointgroup: C01 [X(C13H26Br1N1)]
dipole: -1.1084009 0.4101047 -0.247112 debye
polarizability: 216.6554438|-11.2399265|154.8943281|2.2817215|-1.502035|128.1781571 unknown
InChI: InChI=1S/C13H26BrN/c1-12-6-7-13(2,3)11-15(10-12)9-5-4-8-14/h12H,4-11H2,1-3H3
charge 0 multiplicity 1
41 atoms
Br 6.349998 -0.896041 0.051301
N  -0.089079 0.020813 -0.235277
C  -2.256827 -1.322703 -0.087369
C  -3.225302 -0.130447 0.183362
C  -1.023889 -0.885392 -0.945406
C  -1.773012 1.935613 -0.408608
C  -2.599847 1.19681 0.680206
C  -0.294197 1.466843 -0.468397
C  -3.031177 -2.40365 -0.888986
C  -1.7618 -1.927724 1.248996
C  1.335103 -0.375777 -0.2946
C  -1.801559 3.469359 -0.206864
C  2.177637 0.216191 0.86016
C  3.583454 -0.431201 0.994331
C  4.467133 -0.154467 -0.225598
H  -3.981071 -0.47433 0.919507
H  -3.78363 0.088946 -0.752351
H  -0.473396 -1.805986 -1.224426
H  -1.385521 -0.439603 -1.902246
H  -2.250858 1.718271 -1.387127
H  -3.428289 1.861809 0.999107
H  -1.970593 1.023416 1.574762
H  0.137411 1.786269 -1.455459
H  0.266431 2.017104 0.31296
H  -3.952455 -2.703765 -0.355036
H  -3.32828 -2.027389 -1.887485
H  -2.416311 -3.312459 -1.035274
H  -1.165973 -1.187893 1.810368
H  -2.615614 -2.250914 1.874128
H  -1.119621 -2.812284 1.069414
H  1.801062 -0.094883 -1.27724
H  1.382093 -1.479018 -0.21883
H  -1.159122 3.989065 -0.943512
H  -2.828488 3.863681 -0.314911
H  -1.44076 3.736692 0.805049
H  1.620481 0.052594 1.80281
H  2.293155 1.311353 0.739968
H  3.483658 -1.523848 1.139534
H  4.08015 -0.030366 1.897187
H  4.618532 0.922071 -0.403257
H  4.117675 -0.649261 -1.143493
