program: Gaussian 09
title: 000179045
version: EM64L-G09RevD.01
frameworkgroup: C1[X(C17H28N)]
method: RPBEPBE
basis: SDD
operation: Freq
keyword: #p
keyword: freq=noraman
keyword: PBEPBE/SDD
title: #p freq=noraman PBEPBE/SDD
converged: YES YES NO NO
title: Mulliken charges:
elementType: N C C C C C C C C C C C C C C C C C H H H H H H H H H H H H H H H H H H H H H H H H H H H H
charge: -0.100904 0.300526 -0.366846 -0.448706 -0.353660 -0.054045 -0.421888 -0.571022 -0.620218 -0.756877 -0.710267 -0.718415 0.480715 -0.383388 -0.374143 -0.229991 -0.231039 -0.217103 0.263331 0.246735 0.224401 0.201296 0.251974 0.244151 0.217925 0.247027 0.211347 0.265170 0.281259 0.285165 0.256251 0.297254 0.252354 0.219843 0.205968 0.221742 0.225327 0.239804 0.233922 0.227396 0.215197 0.245185 0.233977 0.252787 0.252250 0.258234
chargesum: 1.00000
title: Mulliken charges with hydrogens summed into heavy atoms:
elementType: N C C C C C C C C C C C C C C C C C
charge: -0.100904 0.300526 0.143220 -0.023009 0.142465 0.163880 0.036485 -0.024593 0.218452 -0.078711 -0.023395 -0.041899 0.480715 -0.138203 -0.140167 0.022796 0.021211 0.041132
polarizability: 2.22050541e+02 -1.45718495e+01 1.62015056e+02 -8.38971130e+00 -1.40717223e+01 1.58211686e+02
1716.lowfreq: -13.1856 -6.0321 -0.0006 -0.0004 0.0002 13.1151 34.1533 51.7281 71.3673
frequency: 32.7723 51.6093 71.2666 108.8676 136.2233 155.2418 172.5766 206.7099 207.8661 215.9727 244.0059 253.0834 266.1706 276.7502 288.3059 301.2305 313.7387 342.2737 362.2856 372.3961 391.9077 407.2183 415.7355 433.2621 443.0431 471.7342 483.0354 523.0298 564.0216 602.9971 617.4228 702.1697 709.6141 726.7355 775.9446 784.1744 815.0589 818.4292 851.0692 859.1851 869.1718 902.1567 911.0123 925.6415 931.0946 938.8790 946.2932 954.3541 979.8095 986.9515 990.6105 993.8600 997.7653 1013.8531 1021.4848 1028.5325 1063.0029 1070.6969 1085.1885 1101.4105 1136.2067 1139.3208 1148.5785 1178.6437 1183.9592 1185.4455 1196.6190 1222.4089 1224.7654 1242.2390 1250.3836 1275.9830 1296.8217 1299.9493 1315.4725 1334.7547 1336.7190 1350.8186 1353.8385 1362.8745 1376.0892 1379.0992 1387.3858 1390.0268 1401.3358 1412.5993 1429.8219 1444.7241 1448.9804 1453.2982 1458.7944 1464.6089 1471.2675 1473.0433 1476.7068 1478.4226 1480.9785 1484.1231 1484.8907 1486.3528 1494.7226 1503.9013 1591.9721 1609.8539 2951.1790 2964.2746 2979.1819 2979.4187 2982.4808 2983.3916 3019.4615 3024.1347 3026.5379 3027.8431 3030.2584 3039.2527 3072.0930 3074.0794 3075.5600 3077.6981 3086.9611 3089.5812 3090.0658 3093.7204 3102.1002 3119.1492 3123.0506 3138.1779 3150.3662 3162.1216 3165.4925 3178.1989
redmass: 3.7583 3.5972 3.7917 3.3516 2.4116 2.9583 2.3794 1.5193 1.6587 1.6091 1.8287 1.8986 1.4001 2.1033 2.7934 2.2177 1.1797 2.4476 2.3124 2.4963 2.2283 2.7941 1.9789 2.3918 2.3372 2.4069 2.4121 2.9080 2.6346 4.2619 6.2362 3.0376 2.5769 1.9486 2.8043 2.1883 3.0406 2.7457 1.9437 1.2665 2.2251 1.9573 2.2885 1.7205 1.7048 1.4558 1.5549 1.7789 1.6587 1.3913 5.9963 1.6912 1.4318 1.3420 2.0268 2.2203 2.9744 1.7940 2.0804 1.6208 1.2779 1.5094 2.1794 1.8054 1.0608 2.0466 1.1208 2.7290 2.0453 1.7565 1.3217 1.2963 1.2965 1.3030 1.2995 1.2656 1.3119 1.3624 1.4305 1.4084 1.2802 1.3328 1.7397 2.2184 1.2043 1.2089 1.1464 1.8739 1.1394 1.0923 1.0837 1.0587 1.0923 1.0716 1.0700 1.0533 1.0604 1.4216 1.4255 1.0649 1.0590 1.0560 5.8518 6.0222 1.0689 1.0763 1.0366 1.0426 1.0386 1.0556 1.0659 1.0585 1.0559 1.0940 1.0420 1.0933 1.1005 1.0992 1.0996 1.0986 1.0997 1.1033 1.1014 1.1033 1.1060 1.0902 1.0898 1.1034 1.0894 1.0952 1.1028 1.1013
irintensity: 0.2382 0.3964 0.3180 0.6891 0.2783 0.3861 1.5150 0.0155 0.0828 0.1062 0.0348 0.3172 0.4603 0.3897 2.3002 0.5676 0.4660 0.6131 0.2902 0.3198 0.2291 0.1492 0.2266 0.3733 1.7910 2.8677 1.5153 2.0524 1.8700 4.8539 0.0627 5.3581 12.9487 137.5651 2.2328 16.3962 39.6797 3.4609 4.1235 0.5396 11.1725 8.7291 8.5700 10.6145 6.4665 2.2162 7.1549 12.0275 1.7762 0.1736 3.4672 4.6629 4.0815 0.0769 3.5732 1.2866 7.9540 7.2835 2.5460 5.6397 2.0252 0.6447 0.8705 5.3884 0.0845 6.5536 0.6318 29.4837 5.0751 9.6676 2.8151 2.0392 0.1445 3.2506 2.9771 1.0181 4.6186 5.7350 1.6660 10.0082 7.8073 8.2175 14.8177 4.7385 7.3289 17.3268 17.0727 8.5625 17.5373 2.7581 6.5699 7.7416 10.3640 7.8542 12.4934 15.2970 11.2513 21.6094 21.3377 43.0138 21.0587 23.2278 2.8543 3.8479 6.2838 20.6821 21.4011 17.5830 1.7120 42.8483 4.2803 14.1863 9.2038 18.1208 11.6813 27.8446 5.6980 46.0230 31.0353 29.5906 22.1536 6.0420 25.3041 19.2046 5.7136 11.2463 11.1227 3.9045 1.5268 11.6366 0.3787 6.8315
temp: 298.150 k
press: 1.00000 atm
elementType: 7 6 6 6 6 6 6 6 6 6 6 6 6 6 6 6 6 6 1 1 1 1 1 1 1 1 1 1 1 1 1 1 1 1 1 1 1 1 1 1 1 1 1 1 1 1
symmnumber: 1
zpe: 1091063.3 jmol-1
zpe.correction: 0.415564 hartree
zpe.thermalcorrener: 0.433989 hartree
zpe.thermalcorrenthalpy: 0.434934 hartree
zpe.thermalcorrgfe: 0.370812 hartree
zpe.sumelectzpe: -717.708940 hartree
zpe.sumelectthermal: -717.690514 hartree
zpe.sumelectthermalent: -717.689570 hartree
zpe.sumelectthermalfe: -717.753692 hartree
dipole: 0.0721 -1.7599 1.7822
dipole: 2.5057
quadrupole: -75.7336 -96.0084 -97.8992
quadrupole: -3.0110 -1.3169 -5.1790
quadrupole: 14.1468 -6.1280 -8.0188 -3.0110 -1.3169 -5.1790
hfenergy: -718.1245036 hartree
pointgroup: C01 [X(C17H28N1)]
dipole: 0.0303147 0.7089556 -0.6843453 debye
polarizability: 222.2720205|13.9708372|162.5263209|8.4485089|-14.0595386|157.4789416 unknown
InChI: InChI=1S/C17H28N/c1-15-10-11-18(4,14-17(2,3)12-15)13-16-8-6-5-7-9-16/h5-9,15H,10-14H2,1-4H3
charge 1 multiplicity 1
46 atoms
N  0.244592 0.824746 -0.635922
C  1.844936 -1.372884 -0.523799
C  0.49915 -0.64781 -0.209896
C  2.954273 -0.983498 0.503612
C  1.47289 1.760695 -0.500286
C  3.490993 0.468011 0.509005
C  2.381439 1.530423 0.719556
C  -0.892403 1.422937 0.291921
C  -0.230628 0.879352 -2.082993
C  2.351983 -1.252156 -1.985382
C  1.502069 -2.876959 -0.270424
C  4.576605 0.614754 1.602372
C  -2.180986 0.633415 0.356695
C  -3.227632 0.887388 -0.571284
C  -2.399245 -0.314938 1.39159
C  -4.44787 0.182289 -0.489513
C  -3.619698 -1.018823 1.476109
C  -4.643398 -0.77782 0.530367
H  -0.345067 -1.204284 -0.65129
H  0.365703 -0.665407 0.885262
H  3.81319 -1.662487 0.336245
H  2.577364 -1.217291 1.522808
H  1.049978 2.781103 -0.494225
H  2.057392 1.648749 -1.428303
H  3.971694 0.677745 -0.47024
H  2.869133 2.503403 0.923605
H  1.794241 1.300805 1.632291
H  -1.066735 2.435366 -0.112464
H  -0.422405 1.515066 1.284977
H  -1.179106 0.331234 -2.171819
H  -0.37856 1.932714 -2.370193
H  0.527931 0.421338 -2.730006
H  3.227928 -1.912652 -2.114501
H  1.588868 -1.586545 -2.712622
H  2.683588 -0.235584 -2.262061
H  1.091476 -3.040926 0.743665
H  0.769685 -3.256355 -1.00628
H  2.416864 -3.488357 -0.359323
H  5.385873 -0.123042 1.459511
H  5.033688 1.620635 1.584635
H  4.15162 0.452688 2.611291
H  -3.104072 1.658056 -1.34261
H  -1.627034 -0.489146 2.151398
H  -5.248475 0.391987 -1.205897
H  -3.778658 -1.74064 2.283558
H  -5.592578 -1.318799 0.599861
