program: Gaussian 09
title: 000179092
version: EM64L-G09RevD.01
frameworkgroup: C1[X(C22H23NO6)]
method: RPBEPBE
basis: SDD
operation: Freq
keyword: #p
keyword: freq=noraman
keyword: PBEPBE/SDD
title: #p freq=noraman PBEPBE/SDD
converged: YES YES NO NO
title: Mulliken charges:
elementType: O O O O O O N C C C C C C C C C C C C C C C C C C C C C C H H H H H H H H H H H H H H H H H H H H H H H
charge: -0.253902 -0.290227 -0.261963 -0.290528 -0.270771 -0.268900 -0.105237 -0.198862 0.084401 -0.336857 0.419859 0.167947 -0.400969 -0.547212 0.251973 0.256012 -0.022093 -0.603670 -0.661053 0.172421 -0.013446 -0.411265 0.214343 -0.384025 -0.199717 0.321395 -0.764382 -0.512848 -0.534395 0.212495 0.316882 0.214822 0.190349 0.235456 0.209304 0.259816 0.281868 0.185332 0.217762 0.280563 0.240443 0.238117 0.227650 0.252144 0.245775 0.238337 0.236138 0.214405 0.252487 0.244834 0.221607 0.227387
chargesum: 0.00000
title: Mulliken charges with hydrogens summed into heavy atoms:
elementType: O O O O O O N C C C C C C C C C C C C C C C C C C C C C C
charge: -0.253902 -0.290227 -0.261963 -0.290528 -0.270771 -0.268900 -0.105237 0.013633 0.084401 -0.019975 0.419859 0.167947 0.004201 -0.102452 0.251973 0.256012 -0.022093 -0.343854 0.023909 0.172421 -0.013446 -0.130703 0.214343 -0.143582 0.266050 0.321395 -0.028125 0.190181 0.159432
polarizability: 3.56544307e+02 3.12635561e+00 3.08354305e+02 -8.28160483e+00 1.22114095e+01 1.74080425e+02
1716.lowfreq: -9.6359 -8.4167 -5.9578 -0.0008 -0.0008 0.0007 20.5252 33.5165 37.3925
frequency: 19.7764 33.5018 37.2624 48.9521 54.8084 68.5541 78.3092 82.0835 99.5281 107.7591 116.8367 117.9839 139.0724 148.2838 165.0744 190.3248 196.3014 202.5594 204.6481 223.6541 225.8333 241.6704 256.5554 275.0885 298.7024 300.1562 318.0927 338.1344 351.7375 360.7192 373.1195 386.1965 409.1277 431.1799 468.9605 484.3889 500.1681 516.6312 535.7920 550.5312 575.8217 584.8072 599.7915 607.2086 631.6763 651.1722 684.8351 690.8531 701.2664 716.8243 729.5546 759.7273 775.8350 787.8744 792.7654 816.2327 827.0353 842.0058 866.6896 875.4304 897.7225 909.3121 940.4034 943.3783 947.9577 955.2977 981.4791 996.0520 1006.4019 1021.1481 1039.8134 1047.8058 1067.1185 1068.4721 1076.6840 1079.9292 1108.1860 1111.4364 1116.6980 1127.1105 1135.6358 1147.5694 1151.1472 1168.6388 1179.4727 1194.9017 1195.7339 1202.4834 1219.1937 1227.6819 1245.5426 1251.5385 1258.9756 1277.9044 1289.2288 1300.7841 1327.6569 1339.4470 1346.6294 1362.2219 1369.0312 1375.7663 1379.9093 1402.6900 1422.8660 1428.8997 1433.4462 1438.2519 1440.6142 1449.0387 1453.6575 1454.0605 1454.7403 1461.4973 1466.1877 1466.4807 1473.5006 1476.8421 1479.9350 1480.3316 1490.5738 1494.9636 1572.4203 1606.8968 1610.5674 1633.1485 1641.3213 2756.8761 2845.9298 2868.7078 2962.8450 2977.4481 2977.9841 2985.7812 3006.3427 3033.7978 3037.7196 3041.8220 3052.9097 3082.4578 3092.1295 3099.1018 3099.7809 3112.7709 3125.9118 3129.0772 3139.2238 3155.1807 3164.6108 3185.5177
redmass: 3.1504 4.5418 3.3254 3.8711 3.0075 1.9865 1.6461 2.9517 3.7133 2.9092 2.5613 3.9652 3.5944 1.9509 3.7388 3.5303 2.8970 2.6470 3.3159 2.6333 2.7308 1.6739 3.0040 3.4833 3.5674 5.5823 3.9131 5.3712 4.5924 4.8917 4.5968 4.3650 3.7794 3.9096 3.6514 5.2327 4.6169 3.8718 4.2346 3.2501 5.5191 6.8902 5.2691 6.1457 4.6256 4.7529 6.9499 4.3333 5.6528 6.8798 5.3912 5.7643 6.2158 4.8634 7.1469 1.6075 2.5363 6.9133 1.5851 5.4933 6.1379 6.9372 6.3488 1.3699 2.8763 3.9493 5.8443 1.8408 5.2530 2.6340 1.6486 2.8459 2.6224 3.2628 1.5356 1.8725 1.2402 1.2589 1.4029 2.4877 1.1354 1.4772 1.3854 2.0777 1.4240 2.2199 1.7300 3.4890 1.5398 3.2590 1.8705 2.3495 1.8466 2.1743 1.7496 1.7552 1.4978 1.7365 1.6440 2.0903 2.0577 1.4643 1.2541 5.9937 1.4174 2.3617 1.9697 1.2677 1.6979 1.3239 1.1632 1.0890 1.0876 1.9918 1.0652 1.0586 1.1800 1.0559 1.1596 1.1145 1.7299 1.3841 7.3042 7.2400 8.7553 10.1201 9.0051 1.0764 1.0701 1.0568 1.0326 1.0334 1.0600 1.0634 1.0370 1.0973 1.0901 1.0761 1.1041 1.1002 1.0921 1.0956 1.0930 1.1070 1.0998 1.1038 1.1022 1.0884 1.0930 1.0948
irintensity: 3.7268 0.3375 1.8907 0.8022 3.5927 2.3847 0.6077 1.8844 1.7510 9.9636 3.2997 3.0627 8.8890 2.9413 0.6930 6.0858 2.8564 0.5075 1.6249 3.2069 0.9236 0.4505 1.2736 0.4506 1.6739 6.5744 8.4160 4.1859 2.1597 0.4610 0.8642 1.2630 0.9455 8.9929 2.1785 9.4181 4.4944 2.0222 0.0866 1.7058 11.4387 1.8605 4.6800 11.1662 8.3314 3.7824 1.6622 7.8136 5.2996 25.1480 11.3189 4.5825 5.1411 8.9632 12.7696 43.8108 15.2529 40.3197 27.0510 28.6356 2.3167 70.4242 78.8689 0.4736 6.5139 19.4391 146.0700 52.3037 67.9277 18.0478 6.3933 32.1503 6.6517 40.9171 10.1340 32.4122 6.2991 0.1404 2.1327 23.9109 4.5100 7.5732 0.8683 8.5413 41.3020 131.8122 13.7716 268.5184 27.6907 60.0645 24.2739 257.1530 93.2104 0.6891 23.3240 10.7939 5.0497 48.6974 32.4568 54.0621 14.2987 9.9707 51.3315 55.8156 1.6119 28.0268 15.9690 6.3963 28.2181 45.3333 32.0604 14.5208 5.8519 50.0537 8.6709 16.8997 53.4353 15.8012 12.1389 4.4726 89.9400 38.7605 18.0884 31.8551 10.2180 8.4845 206.3202 58.2538 69.0529 167.5853 81.4506 73.8525 30.3562 134.8208 3.4819 41.1314 21.0592 57.3880 42.6332 37.7113 8.0714 9.1676 7.1440 30.7308 23.4695 14.4761 12.7613 12.6965 3.2655 4.2593
temp: 298.150 k
press: 1.00000 atm
elementType: 8 8 8 8 8 8 7 6 6 6 6 6 6 6 6 6 6 6 6 6 6 6 6 6 6 6 6 6 6 1 1 1 1 1 1 1 1 1 1 1 1 1 1 1 1 1 1 1 1 1 1 1
symmnumber: 1
zpe: 1073838.8 jmol-1
zpe.correction: 0.409004 hartree
zpe.thermalcorrener: 0.436167 hartree
zpe.thermalcorrenthalpy: 0.437111 hartree
zpe.thermalcorrgfe: 0.350853 hartree
zpe.sumelectzpe: -1356.069823 hartree
zpe.sumelectthermal: -1356.042660 hartree
zpe.sumelectthermalent: -1356.041716 hartree
zpe.sumelectthermalfe: -1356.127974 hartree
dipole: 0.9195 3.3685 0.9961
dipole: 3.6310
quadrupole: -148.9817 -157.1941 -162.0204
quadrupole: 18.0377 2.1499 2.5683
quadrupole: 7.0837 -1.1288 -5.9550 18.0377 2.1499 2.5683
hfenergy: -1356.4788269 hartree
pointgroup: C01[X(C22H23N1O6)]
dipole: 0.2724436 1.4008157 0.0654154 debye
polarizability: 351.4309542|2.5510114|307.7381833|-29.6868902|-18.0475279|179.8098997 unknown
InChI: InChI=1S/C22H23NO6/c1-11(24)29-22-18-13(5-6-14(25-3)20(18)26-4)17-16-12(7-8-23(2)19(16)22)9-15-21(17)28-10-27-15/h5-6,9,19,22H,7-8,10H2,1-4H3
charge 0 multiplicity 1
52 atoms
O  0.572773 -1.268984 1.45556
O  -1.800176 3.346604 -0.08107
O  -4.090043 2.885756 0.414617
O  3.449704 -0.908355 -0.6515
O  4.507178 1.588251 -1.364964
O  1.633471 -3.34912 1.653107
N  -1.175177 -2.910627 -0.364069
C  -0.653004 -1.559542 -0.683139
C  -1.625479 -0.429822 -0.324712
C  0.726568 -1.293589 -0.043248
C  -2.981389 -0.689265 -0.017839
C  -1.098653 0.91179 -0.350551
C  -2.589466 -3.054664 -0.789622
C  -3.485514 -2.121742 0.034619
C  1.249357 0.059187 -0.469594
C  0.338054 1.148864 -0.616949
C  -2.023629 1.934705 -0.081334
C  -3.885026 0.378275 0.257299
C  -0.329725 -3.992159 -0.923493
C  -3.374274 1.671619 0.217346
C  2.630904 0.231974 -0.710431
C  0.85298 2.415257 -0.988421
C  3.129613 1.512073 -1.103533
C  2.230433 2.595502 -1.226999
C  -3.038846 3.92457 0.500088
C  1.008545 -2.390402 2.163874
C  0.615285 -2.2656 3.620928
C  4.600878 -0.878388 0.275802
C  5.029456 2.86569 -1.858547
H  -0.457418 -1.480751 -1.792659
H  1.454607 -2.081166 -0.288778
H  -2.888784 -4.106136 -0.628569
H  -2.715498 -2.834801 -1.881671
H  -3.490102 -2.475572 1.084332
H  -4.527682 -2.17463 -0.334616
H  -4.936189 0.186227 0.489082
H  0.658532 -4.002597 -0.43736
H  -0.192423 -3.904361 -2.030679
H  -0.809156 -4.963393 -0.710623
H  0.176605 3.265599 -1.095018
H  2.592845 3.584012 -1.524161
H  -3.341695 4.796118 -0.099095
H  -2.854769 4.170613 1.564422
H  -0.452527 -2.529249 3.727771
H  0.738904 -1.228449 3.971546
H  1.21616 -2.956367 4.230787
H  5.041842 -1.884119 0.209912
H  4.255208 -0.68952 1.310085
H  5.329474 -0.110146 -0.031798
H  6.100711 2.688141 -2.033234
H  4.901207 3.670995 -1.109509
H  4.538348 3.157097 -2.806693
