program: Gaussian 09
title: 000179108
version: EM64L-G09RevD.01
frameworkgroup: C1[X(C19H26O10)]
method: RPBEPBE
basis: SDD
operation: Freq
keyword: #p
keyword: freq=noraman
keyword: PBEPBE/SDD
title: #p freq=noraman PBEPBE/SDD
converged: YES YES NO NO
title: Mulliken charges:
elementType: O O O O O O O O O O C C C C C C C C C C C C C C C C C C C H H H H H H H H H H H H H H H H H H H H H H H H H H
charge: -0.288315 -0.346153 -0.230313 -0.447426 -0.432064 -0.334576 -0.437969 -0.460235 -0.459433 -0.469476 0.041327 -0.178556 -0.206934 -0.138153 -0.093425 -0.364126 -0.082559 -0.080204 -0.137548 -0.217047 -0.336040 0.436148 -0.360822 -0.374751 -0.379060 -0.405224 0.471700 -0.235199 -0.575754 0.273127 0.242561 0.268322 0.256255 0.241440 0.233441 0.242037 0.303906 0.233166 0.257017 0.262033 0.228150 0.230742 0.351098 0.364753 0.377568 0.370137 0.357563 0.377030 0.234965 0.246720 0.234878 0.253905 0.222008 0.221044 0.238318
chargesum: 0.00000
title: Mulliken charges with hydrogens summed into heavy atoms:
elementType: O O O O O O O O O O C C C C C C C C C C C C C C C C C C C
charge: -0.288315 -0.346153 -0.230313 -0.096328 -0.067311 -0.334576 -0.060401 -0.090098 -0.101869 -0.092446 0.314454 0.064004 0.061388 0.118102 0.148016 0.111353 0.221348 0.152962 0.119469 0.044986 0.122851 0.436148 -0.125857 -0.128030 -0.144182 -0.151320 0.471700 -0.013191 -0.116392
polarizability: 3.04731029e+02 2.10643180e+01 2.15347312e+02 7.62169218e+00 -1.40130546e+01 1.88907110e+02
1716.lowfreq: -39.3052 -6.1470 -0.0007 0.0004 0.0006 1.9282 8.3408 21.8620 28.5107
frequency: -39.0493 21.6938 28.2704 31.3144 37.3204 41.4074 49.8516 73.6888 76.5831 95.9843 104.1288 108.9998 137.1371 152.7789 160.5845 172.6239 185.2891 205.9833 218.3666 223.9235 228.4585 250.7787 260.4203 283.0616 305.8685 324.5639 340.7633 351.6454 359.1836 371.1012 381.1095 389.0161 394.1572 401.3669 414.0236 420.7212 439.2236 463.1070 470.0191 499.3005 510.0457 528.4420 540.0783 546.7922 547.2272 574.3248 592.4834 598.0401 620.5735 631.9328 651.1364 657.2818 723.3169 746.7601 748.8971 762.9959 773.3672 788.6286 805.4038 818.7254 824.5540 831.7701 846.0925 858.5344 865.6216 890.9510 900.9510 914.9501 932.0301 946.6492 952.5949 962.7222 967.0352 980.0626 984.8622 995.5596 1000.6553 1001.7480 1003.4615 1012.6819 1024.1472 1031.1837 1037.4034 1046.1276 1059.1924 1063.6731 1093.8716 1117.5511 1118.8572 1132.8788 1140.7675 1162.1495 1195.9987 1197.3829 1205.1471 1215.4592 1217.5118 1218.1939 1225.7763 1226.4506 1237.8774 1257.2108 1262.3970 1264.5824 1272.5383 1279.1609 1287.9784 1300.2505 1302.4529 1310.3734 1315.0065 1322.1768 1328.0422 1329.9517 1345.1403 1348.4670 1360.3288 1364.7059 1369.1234 1371.0000 1379.6481 1388.8156 1400.4260 1406.3261 1413.1969 1429.6725 1438.1707 1453.3010 1459.0472 1496.2528 1582.1195 1613.8147 1635.3836 2966.5773 2999.2633 3002.8099 3007.4747 3044.3066 3049.2048 3055.3858 3061.2532 3063.7767 3072.3944 3075.0716 3077.7446 3091.6049 3102.7519 3103.0467 3129.7458 3139.2009 3156.1990 3164.8966 3205.0219 3259.0066 3453.1145 3486.7398 3530.6209 3536.1964 3567.6848
redmass: 2.1455 5.0816 5.7380 4.2218 5.3940 4.7696 5.0381 6.6723 4.9300 4.8307 4.9141 2.5887 2.8801 4.4701 3.0966 4.8307 5.8778 5.0009 4.7123 3.8991 5.7790 4.2246 4.5821 5.9893 3.1406 3.5303 2.3675 1.6876 2.3465 3.1225 4.8212 2.8567 3.5844 3.6043 3.0591 4.5535 5.1615 3.8351 4.8253 3.2718 4.5894 3.1921 1.1403 1.2318 3.9530 5.0627 4.1299 3.9839 5.0869 5.7976 1.9271 4.2944 3.9309 3.5406 3.1328 3.3821 1.2441 4.7259 3.8726 3.4731 1.5004 2.7386 2.0867 3.6790 3.2729 3.0993 6.4432 4.7578 2.8585 1.3493 1.3958 4.0022 1.4059 4.4888 4.4901 5.0819 1.9305 1.6872 2.7652 3.6915 3.6726 1.4987 2.6632 3.1497 2.7923 3.0358 4.0993 1.6028 1.9281 2.4032 2.1633 1.8965 1.1925 1.4634 1.1837 1.1410 1.3577 2.1305 1.7215 1.2091 1.1601 1.3925 1.2709 1.3346 1.2237 1.2302 1.3660 1.3471 1.2857 1.2988 1.2158 1.1854 1.2779 1.2711 1.3379 1.3172 1.3394 1.3080 1.3531 3.9845 1.2434 1.2293 1.4670 1.5091 3.5354 1.1564 1.2815 1.0835 1.0825 2.4742 6.8082 6.2519 4.3437 1.0848 1.0601 1.0612 1.0830 1.0862 1.0846 1.0871 1.0872 1.0886 1.0883 1.1042 1.1015 1.0739 1.0785 1.0889 1.0883 1.0881 1.0961 1.0968 1.1141 1.0667 1.0646 1.0652 1.0666 1.0652 1.0660
irintensity: 114.2206 4.2616 0.9871 9.5760 0.4456 3.7939 1.8984 6.2411 2.8142 1.2293 5.7619 31.4118 46.6957 1.3538 1.7729 5.5231 8.1860 4.5170 12.6635 13.9964 20.9602 27.0825 4.8767 2.6037 4.0977 11.1427 59.1068 119.1136 31.1331 6.5337 3.4363 32.6404 2.9214 14.8652 2.2360 8.3052 0.1104 26.9442 8.7970 12.5099 14.7836 21.4746 115.6770 94.2741 9.7027 16.3765 2.0961 37.3107 3.9547 4.3363 0.7835 1.6580 2.1687 9.0075 3.7712 18.4226 121.7765 29.6941 6.6119 33.2882 27.6956 103.7409 50.2543 14.3801 75.7251 16.2659 343.8068 72.9871 23.6141 128.1243 1.4747 115.8842 5.6129 86.3355 67.5867 108.4590 81.2220 2.4200 9.1427 28.6310 44.7676 4.7580 9.0903 85.1648 8.5370 27.4387 87.3353 10.9455 2.7165 2.9802 22.1822 134.2113 22.5777 66.5284 67.3000 8.7295 37.0228 14.4237 21.5831 39.5013 3.0589 4.6652 40.8606 11.1315 19.0678 9.2281 1.3232 2.1753 10.1710 1.5261 2.8523 1.3182 0.5068 1.9378 5.4245 7.0769 11.2751 25.0690 0.8419 6.2303 16.8610 59.5910 20.0725 7.0409 4.5931 55.4421 5.4962 14.0994 4.4452 96.0662 2.7536 32.8809 15.6667 42.0791 23.2248 55.6748 10.9321 8.3919 7.8479 22.4465 24.8078 15.3095 30.0149 10.6710 41.5211 16.6791 3.0228 3.4288 12.8223 7.9902 12.5865 3.2228 21.3324 274.0091 24.3257 24.3299 56.5553 32.1113 8.4261
temp: 298.150 k
press: 1.00000 atm
elementType: 8 8 8 8 8 8 8 8 8 8 6 6 6 6 6 6 6 6 6 6 6 6 6 6 6 6 6 6 6 1 1 1 1 1 1 1 1 1 1 1 1 1 1 1 1 1 1 1 1 1 1 1 1 1 1
symmnumber: 1
zpe: 1147036.4 jmol-1
zpe.correction: 0.436883 hartree
zpe.thermalcorrener: 0.464869 hartree
zpe.thermalcorrenthalpy: 0.465813 hartree
zpe.thermalcorrgfe: 0.377761 hartree
zpe.sumelectzpe: -1489.518567 hartree
zpe.sumelectthermal: -1489.490581 hartree
zpe.sumelectthermalent: -1489.489637 hartree
zpe.sumelectthermalfe: -1489.577689 hartree
dipole: -0.0692 -0.1828 0.0370
dipole: 0.1989
quadrupole: -182.4117 -163.1125 -175.3275
quadrupole: 9.6258 -7.1913 -8.0621
quadrupole: -8.7945 10.5047 -1.7103 9.6258 -7.1913 -8.0621
hfenergy: -1489.9554499 hartree
pointgroup: C01 [X(C19H26O10)]
dipole: 0.0010891 0.0758804 0.0191483 debye
polarizability: 282.2102842|44.5276504|236.9692259|-5.8448284|15.1753536|189.8059411 unknown
InChI: InChI=1S/C19H26O10/c1-2-9-3-5-10(6-4-9)28-19-17(25)15(23)14(22)12(29-19)8-27-18-16(24)13(21)11(20)7-26-18/h2-6,11-25H,1,7-8H2
charge 0 multiplicity 1
55 atoms
O  1.645694 1.043841 -0.760205
O  -1.053307 1.597342 0.450171
O  -2.254718 2.236226 -1.53852
O  2.949415 2.332975 2.267386
O  3.531499 3.048443 -1.393968
O  2.556619 -0.887062 0.364235
O  4.810013 0.327547 0.8464
O  -2.343187 -0.971007 -1.712506
O  -4.590999 -0.587652 0.63313
O  -3.535989 1.855422 1.536292
C  1.409478 1.766266 0.525287
C  2.628437 2.66489 0.86936
C  3.802952 2.390387 -0.106443
C  4.105919 0.878922 -0.302492
C  2.782651 0.116724 -0.670804
C  0.092161 2.523184 0.381633
C  -1.581393 1.14967 -0.87268
C  -2.479416 -0.068643 -0.566956
C  -3.964158 0.323504 -0.332602
C  -4.093851 1.778417 0.168533
C  -3.449485 2.770288 -0.819178
C  1.477697 -1.798114 0.143735
C  1.405708 -2.594586 -1.019524
C  0.508152 -1.913911 1.161904
C  0.303344 -3.453272 -1.191818
C  -0.588865 -2.777026 0.977225
C  -0.7362 -3.52666 -0.223506
C  -1.939457 -4.336364 -0.51533
C  -3.175415 -4.169683 0.037423
H  1.311836 1.017301 1.330923
H  2.376836 3.742401 0.769428
H  4.72401 2.870344 0.266577
H  4.804355 0.797229 -1.152907
H  2.81579 -0.341211 -1.672488
H  0.050998 3.106995 -0.558223
H  -0.016323 3.211369 1.238746
H  -0.749346 0.862098 -1.533055
H  -2.089704 -0.548382 0.351744
H  -4.510735 0.195422 -1.282571
H  -5.159726 2.029721 0.300373
H  -3.159046 3.691449 -0.279312
H  -4.156435 3.03094 -1.625378
H  3.763125 2.82522 2.544969
H  2.714234 2.623338 -1.771933
H  4.140257 -0.078938 1.456514
H  -2.710094 -1.858544 -1.461351
H  -4.386118 -0.19821 1.52915
H  -2.532645 1.823248 1.44478
H  2.191004 -2.544953 -1.781153
H  0.616303 -1.323382 2.07704
H  0.227211 -4.051826 -2.107319
H  -1.339165 -2.871119 1.769706
H  -1.813857 -5.111952 -1.285278
H  -4.012564 -4.812442 -0.253626
H  -3.399697 -3.384085 0.769557
