program: Gaussian 09
title: 000179120
version: EM64L-G09RevD.01
frameworkgroup: C1[X(C20H30N2O7S)]
method: RPBEPBE
basis: SDD
operation: Freq
keyword: #p
keyword: freq=noraman
keyword: PBEPBE/SDD
title: #p freq=noraman PBEPBE/SDD
converged: YES YES NO NO
title: Mulliken charges:
elementType: S O O O O O O O N N C C C C C C C C C C C C C C C C C C C C H H H H H H H H H H H H H H H H H H H H H H H H H H H H H H
charge: 1.058845 -0.273197 -0.315411 -0.461457 -0.531354 -0.261495 -0.269317 -0.240355 -0.313753 -0.414937 0.348001 -0.586522 0.272214 0.049761 -0.713170 -0.734444 -0.043363 0.279123 -0.424442 -0.400204 -0.313477 -0.224375 -0.679157 -0.673601 -0.500038 0.413562 -0.583686 0.314812 -0.271883 -0.662198 0.240903 0.233627 0.207116 0.227474 0.242418 0.230078 0.209272 0.235716 0.222905 0.239064 0.236555 0.322163 0.275800 0.225966 0.264529 0.201771 0.224704 0.249375 0.219052 0.231546 0.251390 0.236823 0.255853 0.259768 0.255356 0.239803 0.224261 0.214064 0.250359 0.227805
chargesum: 0.00000
title: Mulliken charges with hydrogens summed into heavy atoms:
elementType: S O O O O O O O N N C C C C C C C C C C C C C C C C C C C C
charge: 1.058845 -0.273197 -0.315411 -0.461457 -0.531354 -0.261495 -0.269317 -0.240355 -0.313753 -0.414937 0.348001 -0.111992 0.272214 0.049761 -0.036162 -0.059378 0.179542 0.279123 -0.185378 0.158515 -0.037677 0.001591 0.011846 0.026373 -0.011825 0.413562 0.187291 0.314812 0.192182 0.030031
polarizability: 3.56074923e+02 -7.05623220e+00 2.76733870e+02 9.02912902e+00 2.78932215e+01 2.38059912e+02
1716.lowfreq: -8.4674 -6.6653 -2.7846 -0.0011 -0.0009 -0.0004 6.1595 13.8992 18.9535
frequency: 3.1762 12.7932 18.5292 26.7643 30.2162 34.1111 45.4556 54.9784 67.4572 73.7925 74.5650 81.4514 105.5061 108.4934 121.7168 125.9732 134.3377 155.8358 165.4827 173.9664 192.3306 199.2500 200.2991 208.0758 210.5009 220.8099 232.0754 235.5029 241.9634 246.9381 255.1718 274.7724 283.6358 298.0494 302.2224 314.3291 320.5563 321.3972 356.4199 362.3137 380.5645 393.5267 412.4631 432.5572 435.8826 465.3986 473.9891 481.1931 504.4781 518.4122 539.4127 540.7173 555.2673 577.2616 578.0276 589.1457 644.8057 663.3225 674.3243 705.8989 729.8803 731.6946 743.6333 772.6745 773.0317 811.9781 815.8071 824.5259 840.1157 850.0518 855.2635 861.4649 887.3151 912.9669 913.9903 920.6956 938.2683 943.4791 953.1603 956.7883 966.0076 983.3952 999.1648 1008.0148 1014.8537 1039.3637 1040.7195 1057.0465 1060.8099 1094.8611 1100.7345 1102.6640 1109.5396 1130.8386 1135.8277 1144.2888 1156.0456 1167.1152 1173.2194 1185.5505 1187.2672 1204.9830 1221.3877 1240.0744 1251.5852 1259.0756 1266.3683 1270.4752 1278.2669 1279.7734 1296.7333 1329.1168 1346.9293 1362.5996 1378.6224 1380.2385 1381.6322 1389.6882 1393.4383 1398.6982 1400.0170 1431.2694 1435.0706 1450.2394 1452.7224 1454.2281 1455.0734 1459.6195 1461.3906 1462.0822 1463.8223 1466.5415 1466.9148 1470.3717 1475.4621 1479.8890 1482.6349 1484.1197 1488.3261 1492.3736 1600.5334 1622.8203 1642.8287 1649.6778 2963.1657 2967.9822 2982.1764 2986.1912 2987.2641 2990.5622 2991.0006 2992.0000 2994.8060 3000.8061 3026.6795 3044.1816 3048.8532 3080.2218 3080.3901 3083.6172 3086.7022 3087.4629 3088.0298 3090.7390 3091.0952 3091.5498 3099.6692 3100.4717 3100.8238 3109.5970 3117.3314 3134.7157 3158.0681 3191.8280
redmass: 4.0356 4.6212 4.4706 4.9583 4.8265 4.1888 3.7882 3.4238 3.3798 3.9736 3.5020 4.0278 4.4099 5.1526 1.6316 2.3888 5.3833 5.3956 3.7374 3.8012 2.7360 1.1829 1.4676 2.3961 1.4349 3.6546 4.0201 4.6311 2.6145 1.4738 1.1165 2.3766 3.9616 3.9182 2.7669 4.0606 3.1898 2.9737 3.1144 3.0739 2.9816 5.8513 4.3992 2.8238 3.9505 3.8612 3.5485 3.4202 4.9624 4.1882 3.9900 4.7247 4.0283 4.0378 6.7773 6.2284 2.9876 7.0284 7.9491 4.8229 5.8966 3.0106 3.4242 2.0609 1.7561 4.4345 1.6483 11.5430 4.1438 6.1342 2.7411 2.8875 1.4240 1.7147 1.8070 1.4111 1.3616 1.4021 1.3446 12.6664 1.7478 2.3383 3.4157 1.5048 2.7326 3.0401 5.5912 2.1863 2.9623 2.1491 1.5144 1.2708 1.7650 1.9049 2.4380 2.3517 1.6903 1.6476 1.3125 3.0641 2.1997 1.3045 1.6199 2.3888 2.6031 1.3184 3.2682 3.2446 1.4375 1.1213 2.1653 1.3178 1.2752 1.4232 1.1828 1.2536 1.2102 1.2339 1.4203 3.6586 1.2008 1.1519 1.0913 1.2132 2.1166 1.0519 1.0844 1.1632 1.2847 1.0617 1.1233 1.1816 1.3241 1.1182 1.0834 1.0489 1.0517 1.0552 1.0734 1.0536 7.3161 8.9328 10.3191 10.1625 1.0784 1.0660 1.0366 1.0576 1.0354 1.0368 1.0393 1.0361 1.0310 1.0637 1.0596 1.1035 1.1004 1.0992 1.0970 1.0993 1.0973 1.0994 1.0995 1.1000 1.1006 1.1029 1.1003 1.1035 1.1009 1.1001 1.1056 1.0881 1.0945 1.0955
irintensity: 0.1220 0.0742 0.1909 0.7206 1.3062 0.2950 1.6541 0.6127 4.9616 1.6882 0.8914 0.3023 0.5952 1.5479 0.7516 0.7195 0.4019 1.3885 1.3859 6.2631 0.1139 0.7270 1.0729 4.3505 2.1558 0.6102 5.9800 4.8964 2.7303 2.3099 0.2132 4.1172 2.3377 3.2149 2.0896 11.0928 10.0786 8.5219 8.4591 1.7162 5.0004 62.3769 12.7381 3.1762 24.0685 8.1513 2.6120 11.6820 71.8868 2.5133 0.6414 20.1693 103.2926 10.0586 12.7707 8.7488 2.2731 16.9577 35.4262 9.9127 5.8127 21.1146 18.9765 30.3965 42.8186 4.8485 2.4213 120.1092 52.4423 35.7732 3.7549 2.3686 0.9721 1.7196 12.3369 7.5724 0.7938 3.2517 0.6151 74.5284 2.7572 13.7665 8.7687 1.8579 28.2221 80.9583 571.6443 78.5878 50.1451 22.4570 52.3390 3.7268 43.3236 66.2455 193.2623 33.6833 21.3605 1.2884 59.2251 88.8656 9.6316 24.9798 59.0996 29.6017 55.5715 17.3017 239.6960 26.8886 1.5975 5.2834 51.2776 27.2591 14.6209 19.6536 2.6939 26.9033 24.8373 22.0495 5.9954 23.2172 26.5064 30.6743 22.9801 15.6423 49.0758 6.8806 3.4303 16.6175 6.5545 22.3671 5.3928 38.4394 52.6630 20.2365 24.3135 12.9336 12.3304 18.4610 24.7057 17.8633 25.1975 19.9996 149.2513 212.2973 22.6561 52.1537 20.9649 20.4661 16.8548 26.4370 36.1205 15.8499 15.5246 17.9595 29.2396 32.5584 14.2257 20.2637 1.2998 8.2051 29.6939 38.9939 49.8504 24.6031 14.2348 3.1592 29.5324 16.4320 0.8628 10.8913 38.8540 5.5086 25.0893 1.6021
temp: 298.150 k
press: 1.00000 atm
elementType: 16 8 8 8 8 8 8 8 7 7 6 6 6 6 6 6 6 6 6 6 6 6 6 6 6 6 6 6 6 6 1 1 1 1 1 1 1 1 1 1 1 1 1 1 1 1 1 1 1 1 1 1 1 1 1 1 1 1 1 1
symmnumber: 1
zpe: 1254868.8 jmol-1
zpe.correction: 0.477954 hartree
zpe.thermalcorrener: 0.512253 hartree
zpe.thermalcorrenthalpy: 0.513197 hartree
zpe.thermalcorrgfe: 0.407032 hartree
zpe.sumelectzpe: -1811.758381 hartree
zpe.sumelectthermal: -1811.724082 hartree
zpe.sumelectthermalent: -1811.723138 hartree
zpe.sumelectthermalfe: -1811.829304 hartree
dipole: -2.4319 6.9165 -1.8725
dipole: 7.5669
quadrupole: -157.7012 -186.8331 -184.0673
quadrupole: 5.4379 -8.9301 3.8802
quadrupole: 18.4993 -10.6326 -7.8668 5.4379 -8.9301 3.8802
hfenergy: -1812.2363352 hartree
pointgroup: C01 [X(C20H30N2O7S1)]
dipole: -0.0462917 -2.8708261 0.7868068 debye
polarizability: 344.5280059|28.8110454|290.3952268|-13.8464251|23.6580016|235.9454729 unknown
InChI: InChI=1S/C20H30N2O7S/c1-7-27-17(23)11-12-22(14(2)3)30(25,26)21(6)19(24)28-16-10-8-9-15-13-20(4,5)29-18(15)16/h8-10,14H,7,11-13H2,1-6H3
charge 0 multiplicity 1
60 atoms
S  2.582206 2.273333 -0.684433
O  -2.652482 -1.352074 -1.12471
O  -1.297932 1.142006 -0.831288
O  2.333373 3.720501 -0.009926
O  3.382902 2.185685 -2.088699
O  -0.106624 2.181222 0.934111
O  2.365126 -2.548662 1.667649
O  0.734176 -0.987988 1.077063
N  3.348847 0.967433 0.475786
N  0.928636 1.456903 -1.066664
C  -3.512625 -2.59182 -0.834235
C  -4.765129 -2.036495 -0.073143
C  -4.316884 -0.658383 0.391681
C  -3.110774 -0.341578 -0.273624
C  -2.648252 -3.502328 0.056681
C  -3.831773 -3.218293 -2.194409
C  4.867611 1.014756 0.462916
C  -2.473067 0.896985 -0.066957
C  -4.902032 0.264077 1.275908
C  2.737319 1.09535 1.841165
C  -3.057704 1.83351 0.814858
C  -4.262615 1.513456 1.483672
C  5.432121 0.223805 -0.731137
C  5.479819 2.431602 0.591682
C  2.664058 -0.311523 2.474677
C  -0.134207 1.647781 -0.196888
C  0.873762 0.626064 -2.279375
C  1.80558 -1.267934 1.658455
C  1.617817 -3.609654 0.920795
C  2.01729 -3.612168 -0.557451
H  -5.636236 -1.96051 -0.752563
H  -5.048468 -2.700885 0.762584
H  -3.180335 -4.446143 0.278262
H  -1.700352 -3.742187 -0.456214
H  -2.409346 -2.998339 1.010037
H  -2.903438 -3.510615 -2.715225
H  -4.457252 -4.120345 -2.063143
H  -4.376694 -2.502701 -2.833573
H  5.111029 0.4536 1.390437
H  -5.836704 0.026918 1.795803
H  3.320182 1.774277 2.496325
H  1.717673 1.510328 1.752443
H  -2.558784 2.789638 0.98701
H  -4.701174 2.244413 2.170499
H  5.232301 0.747727 -1.679844
H  6.525473 0.104381 -0.616393
H  4.971184 -0.778251 -0.778029
H  5.347096 3.000169 -0.345891
H  6.563861 2.350836 0.788219
H  5.021693 3.007098 1.41583
H  2.20296 -0.207583 3.477248
H  3.661103 -0.760104 2.618093
H  0.634184 -0.415344 -2.006374
H  0.103555 1.011805 -2.967116
H  1.855929 0.677843 -2.779863
H  0.5352 -3.429077 1.044178
H  1.9112 -4.540512 1.431905
H  1.528909 -4.458801 -1.075182
H  1.701045 -2.677491 -1.050019
H  3.109566 -3.723814 -0.669909
