program: Gaussian 09
title: 000179058
version: EM64L-G09RevD.01
frameworkgroup: C1[X(C22H34O2)]
method: RPBEPBE
basis: SDD
operation: Freq
keyword: #pfreq=noraman
keyword: PBEPBE/SDD
title: #p freq=noraman PBEPBE/SDD
converged: NO YES NO NO
title: Mulliken charges:
elementType: O O C C C C C C C C C C C C C C C C C C C C C C H H H H H H H H H H H H H H H H H H H H H H H H H H H H H H H H H H
charge: -0.282897 -0.255466 0.466806 -0.140179 -0.155404 -0.539178 -0.549606 -0.574312 -0.572465 -0.823227 0.497395 -0.216936 -0.261767 0.496539 -0.837095 -0.752499 0.404289 -0.305015 -0.555333 -0.494636 -0.851588 -0.850349 0.299907 -0.759228 0.208871 0.212894 0.226151 0.205883 0.225738 0.233388 0.213281 0.239959 0.222416 0.198789 0.221688 0.218011 0.209000 0.258595 0.216598 0.220905 0.234495 0.225555 0.214384 0.216925 0.222670 0.220165 0.202313 0.203358 0.216853 0.249111 0.230743 0.217720 0.217615 0.245946 0.226515 0.246043 0.245926 0.243742
chargesum: 0.00000
title: Mulliken charges with hydrogens summed into heavy atoms:
elementType: O O C C C C C C C C C C C C C C C C C C C C C C
charge: -0.282897 -0.255466 0.466806 0.068692 0.057490 -0.107143 -0.090481 -0.121072 -0.151259 -0.174529 0.497395 0.041658 -0.045168 0.496539 -0.156140 -0.321190 0.404289 -0.082345 -0.132855 -0.074426 -0.154013 -0.160274 0.299907 -0.023518
polarizability: 2.50670671e+02 -8.92441461e+00 2.54140000e+02 -4.03814631e+00 -8.70587858e+00 2.09100603e+02
1716.lowfreq: -10.3503 -6.5092 -0.0007 -0.0006 -0.0003 5.2803 20.9636 30.1381 32.9020
frequency: 19.5638 30.1305 32.8848 46.2486 63.4980 67.3671 77.5373 82.1889 97.2344 120.8772 132.5876 142.1061 157.8856 162.6798 170.2149 179.9265 189.5991 209.7244 219.6663 256.2266 262.9010 270.2962 280.5723 286.1931 308.5846 325.0555 328.0916 336.8171 352.0274 371.8609 390.8294 412.5050 424.9267 452.0434 468.8217 485.2720 511.5603 535.7405 537.7932 542.4934 550.7242 559.1806 569.7947 585.9125 596.7222 641.0583 699.2284 704.8792 746.2021 770.2873 802.9942 831.0496 840.1966 854.1582 869.9168 879.0467 889.2868 894.8664 908.7512 920.7179 921.2475 924.7668 935.4015 956.9135 970.6658 979.3009 984.0256 991.7750 993.5331 1002.0883 1016.1708 1024.9180 1031.8423 1039.7096 1040.8491 1045.2882 1047.5421 1062.4164 1067.5199 1084.5254 1106.5848 1122.5262 1135.4734 1146.1279 1154.2705 1166.7200 1181.9561 1188.9892 1198.1857 1207.5702 1219.9555 1238.0375 1243.7999 1245.8672 1258.3533 1280.8275 1285.5976 1287.5183 1293.4184 1302.4819 1313.2769 1317.4594 1323.7094 1333.5875 1349.6852 1352.6683 1371.8696 1379.1812 1387.2153 1387.5454 1390.2570 1394.8301 1405.3452 1427.7293 1453.5579 1456.6567 1457.2434 1457.7950 1461.4360 1461.9063 1465.8474 1467.9881 1471.7699 1474.5434 1475.9112 1476.7040 1478.1714 1482.0604 1487.8164 1497.1755 1640.5672 1662.4498 1680.3479 1682.3406 2908.5379 2956.0571 2964.7910 2972.6223 2972.7099 2973.1498 2975.2193 2977.4739 2981.7228 2984.4950 2991.5222 3003.7504 3020.3950 3021.5354 3033.4189 3034.3687 3038.9669 3043.8369 3045.9481 3049.1489 3050.4138 3058.0756 3060.6667 3062.3691 3077.0167 3083.9224 3087.8886 3093.0096 3094.5465 3097.9101 3098.5362 3099.3573 3137.8591 3197.4459
redmass: 3.4856 5.0248 4.1588 3.2557 3.3322 2.7541 1.1461 2.5915 3.5028 1.2168 2.6956 3.0148 2.7860 1.2965 1.6383 1.9560 2.3898 2.8373 3.0271 3.2669 2.9382 2.6334 3.4753 1.5436 2.1531 2.3322 2.6878 2.2293 3.0079 2.7373 2.3136 2.4412 2.8987 2.6450 2.5059 3.0677 2.6607 2.5974 2.4434 2.5818 2.5344 2.3516 2.7895 3.0935 2.8633 4.2346 2.8658 1.1805 2.5936 2.6262 2.9338 2.2823 2.2849 1.9773 1.8234 3.0742 1.9228 2.5604 2.0340 1.7163 2.2081 1.3330 1.7994 1.8533 2.0805 1.8263 1.6990 1.6564 1.6885 1.9248 1.9214 1.6093 1.7954 1.5508 1.6159 1.5223 1.5455 2.2491 2.1735 2.8498 2.2011 2.2457 2.0269 1.6201 1.8184 1.6544 1.2472 1.5673 2.7115 1.8087 1.8339 1.8903 1.6864 1.6169 1.4799 1.3837 1.2799 1.2979 1.1995 1.2450 1.4954 1.4615 1.4035 1.4107 1.6402 1.6205 1.3261 1.2418 1.2137 1.2127 1.1989 1.3442 1.3708 1.1850 1.0593 1.0627 1.0805 1.0748 1.0796 1.0517 1.0808 1.0940 1.0610 1.0696 1.0741 1.0711 1.0756 1.0728 1.0728 1.0538 9.6597 4.9065 6.8220 6.8479 1.0812 1.0402 1.0370 1.0561 1.0595 1.0583 1.0404 1.0466 1.0577 1.0612 1.0622 1.0379 1.0978 1.0953 1.1013 1.0967 1.0964 1.0976 1.0940 1.0869 1.0977 1.0984 1.0999 1.0910 1.0901 1.0986 1.0962 1.0938 1.0966 1.0943 1.0662 1.0882 1.1024 1.1119
irintensity: 0.0112 0.6782 0.3951 0.0912 2.5733 0.8836 0.6473 0.3278 0.3672 0.8610 0.1613 0.4211 0.2404 0.1343 2.0280 1.0278 0.2250 0.6974 2.0420 3.8796 1.6606 1.2780 2.3463 1.3758 0.5957 1.1673 0.1252 0.6750 0.2454 3.1590 0.6967 1.3965 1.3014 1.1264 2.3282 0.9739 19.0676 5.2802 2.2247 9.9849 0.3888 2.4547 0.7830 8.2181 1.5534 10.3905 1.4068 0.4134 3.0859 2.1431 36.1233 1.1923 10.8572 4.5533 39.6283 79.1952 18.3048 28.2691 6.1687 14.7600 8.5919 58.6500 7.1576 2.7374 7.9842 20.3508 5.4302 27.5439 27.4606 1.6341 0.7372 17.0315 5.6062 3.0179 6.7201 1.5855 1.6346 11.3987 3.4353 2.0337 15.5697 5.2261 20.3807 1.8345 12.5934 4.5570 2.5387 42.4195 271.7251 65.7342 6.6176 1.2290 10.7414 3.4846 1.7134 6.0941 0.8658 0.5690 9.4295 0.4476 1.1087 1.4001 4.8108 0.7207 3.4021 5.0606 2.0790 54.6556 14.5408 11.6071 23.5954 19.9094 12.2224 1.0957 20.4025 13.9761 8.0427 16.5237 7.7716 12.5614 12.8232 3.8079 8.9562 21.4135 12.4199 11.5119 11.1688 4.8046 17.2404 8.9444 162.8055 23.6547 2.3955 2.9077 20.8969 30.2401 33.9308 15.6977 18.3934 27.9686 18.8398 63.4349 37.3404 73.1938 29.0415 4.0331 17.1509 26.1651 21.5214 12.0614 19.2870 41.8280 30.7131 9.0745 30.2113 17.9995 66.4704 36.1349 21.6895 29.8379 34.1580 6.4206 30.8828 10.2042 5.9287 54.3608 10.6935 35.8356
temp: 298.150 k
press: 1.00000 atm
elementType: 8 8 6 6 6 6 6 6 6 6 6 6 6 6 6 6 6 6 6 6 6 6 6 6 1 1 1 1 1 1 1 1 1 1 1 1 1 1 1 1 1 1 1 1 1 1 1 1 1 1 1 1 1 1 1 1 1 1
symmnumber: 1
zpe: 1330352.7 jmol-1
zpe.correction: 0.506705 hartree
zpe.thermalcorrener: 0.533370 hartree
zpe.thermalcorrenthalpy: 0.534314 hartree
zpe.thermalcorrgfe: 0.449922 hartree
zpe.sumelectzpe: -1007.262101 hartree
zpe.sumelectthermal: -1007.235436 hartree
zpe.sumelectthermalent: -1007.234492 hartree
zpe.sumelectthermalfe: -1007.318884 hartree
dipole: 1.8140 -0.8064 -1.3359
dipole: 2.3928
quadrupole: -151.7700 -141.4232 -147.0777
quadrupole: -0.9954 8.0258 -2.5777
quadrupole: -5.0131 5.3338 -0.3207 -0.9954 8.0258 -2.5777
hfenergy: -1007.7688061 hartree
pointgroup: C01 [X(C22H34O2)]
dipole: 0.7115289 0.2909948 0.5433931 debye
polarizability: 251.946223|9.9714572|250.77646|4.7181317|-11.8266796|211.1885912 unknown
InChI: InChI=1S/C22H34O2/c1-15(2)19-12-13-22(6)14-21(24-18(5)23)17(4)9-7-8-16(3)10-11-20(19)22/h9-10,19-21H,1,7-8,11-14H2,2-6H3
charge 0 multiplicity 1
58 atoms
O  -2.790269 1.74903 0.418315
O  -4.457359 0.988502 -1.038724
C  0.693683 1.205079 -1.244707
C  1.624874 0.1714 -0.451347
C  2.932575 0.956852 -0.077841
C  1.640271 2.4354 -1.471032
C  2.575683 2.46436 -0.249315
C  -0.500735 1.705928 -0.348636
C  2.010863 -1.180761 -1.148343
C  0.16522 0.727024 -2.618892
C  3.604941 0.640727 1.257701
C  -1.771063 0.826971 -0.249501
C  0.880014 -2.188099 -1.200306
C  -1.69897 -0.454479 0.567438
C  4.954244 1.315882 1.463487
C  3.08463 -0.166619 2.221297
C  0.557748 -3.128651 -0.264742
C  -2.032229 -1.626327 -0.047168
C  -0.796659 -3.824127 -0.349315
C  -1.885896 -3.036778 0.475296
C  -1.289041 -0.313013 2.021065
C  1.384277 -3.445583 0.968126
C  -4.102329 1.686379 -0.060693
C  -5.013036 2.560051 0.778949
H  1.088801 -0.102958 0.472824
H  3.682088 0.730313 -0.872148
H  1.077527 3.375682 -1.617614
H  2.245401 2.266672 -2.385128
H  3.46669 3.098256 -0.406742
H  2.050527 2.840482 0.649311
H  -0.850299 2.669643 -0.770152
H  -0.131745 1.930043 0.670364
H  2.866712 -1.594904 -0.579847
H  2.389537 -0.972366 -2.168631
H  -0.520503 -0.132608 -2.543837
H  -0.38551 1.549225 -3.116035
H  0.996593 0.436159 -3.286244
H  -2.169708 0.603592 -1.253957
H  0.184497 -2.080341 -2.044596
H  5.64602 1.07787 0.631372
H  4.85136 2.418013 1.485963
H  5.427972 0.999082 2.408196
H  3.620433 -0.339313 3.162424
H  2.124179 -0.679374 2.112051
H  -2.377699 -1.565546 -1.091689
H  -1.134303 -3.882741 -1.402177
H  -0.74619 -4.860343 0.040138
H  -1.612354 -3.048026 1.545889
H  -2.846778 -3.581625 0.379714
H  -1.920915 0.450101 2.512932
H  -0.241679 0.028953 2.131506
H  -1.395549 -1.257465 2.578859
H  0.825997 -3.210555 1.897735
H  2.336397 -2.892139 1.001082
H  1.615456 -4.528495 1.008605
H  -4.477697 3.449312 1.146675
H  -5.360129 1.984861 1.657094
H  -5.893466 2.854294 0.187854
