program: Gaussian 09
title: 000183595
version: EM64L-G09RevD.01
frameworkgroup: C1[X(C13H14ClFN2O2)]
method: RPBEPBE
basis: SDD
operation: Freq
keyword: #p
keyword: freq=noraman
keyword: PBEPBE/SDD
title: #p freq=noraman PBEPBE/SDD
converged: YES YES NO NO
title: Mulliken charges:
elementType: Cl F O O N N C C C C C C C C C C C C C H H H H H H H H H H H H H H
charge: -0.003778 -0.203498 -0.236880 -0.406762 -0.240556 -0.293747 -0.214516 -0.230800 -0.404397 -0.432352 -0.376567 -0.408336 0.128104 0.425737 -0.476026 0.151110 0.437519 -0.338414 -0.308599 0.250596 0.255012 0.224724 0.211439 0.237345 0.203058 0.188519 0.207523 0.213669 0.209816 0.289498 0.292175 0.281481 0.367903
chargesum: 0.00000
title: Mulliken charges with hydrogens summed into heavy atoms:
elementType: Cl F O O N N C C C C C C C C C C C C C
charge: -0.003778 -0.203498 -0.236880 -0.038858 0.048942 -0.293747 0.036080 0.024212 0.031766 0.008050 0.019475 0.015149 0.128104 0.425737 -0.183851 0.151110 0.437519 -0.056933 -0.308599
polarizability: 2.50435664e+02 -5.59749389e-01 1.62055405e+02 1.39978387e+01 1.21862553e+00 1.06086147e+02
1716.lowfreq: -5.3172 -0.0004 0.0017 0.0018 5.3275 14.0281 32.6542 38.8106 68.3431
frequency: 32.4026 38.4684 68.3247 101.4650 115.4326 136.5140 164.9785 203.9226 211.7986 218.0197 251.5516 280.2172 303.2153 309.0490 330.7987 346.4199 358.0502 392.4031 408.9889 441.3390 443.2392 462.4182 490.8577 511.3715 547.9129 578.0562 627.1278 647.8492 671.9271 680.8153 694.4994 743.0215 757.8645 779.0446 807.3344 813.9482 829.0696 851.5046 860.8450 878.9072 913.2090 929.5476 965.8410 983.1728 1007.1451 1060.9656 1065.8569 1081.3826 1083.4357 1109.6992 1113.3572 1129.3218 1162.4093 1184.7620 1205.3254 1223.3867 1239.0390 1245.5816 1257.7628 1274.3187 1298.0860 1308.9285 1311.9657 1336.2744 1344.8080 1349.1336 1354.1359 1359.4819 1385.9374 1398.7841 1422.0357 1458.7601 1463.8422 1471.2408 1475.5786 1509.4052 1599.5043 1611.7549 1627.3004 2949.4135 2969.2431 2981.7956 2986.5407 2988.3555 3030.7820 3039.0345 3040.5025 3051.5490 3060.9005 3161.4899 3186.5412 3338.8842 3585.1192
redmass: 6.1734 5.5551 6.0835 4.9291 6.8466 3.7930 5.4590 5.7832 9.5826 4.9864 3.5583 6.8275 7.2722 7.0547 1.9087 1.1343 2.7473 9.5686 3.9669 3.4344 5.6721 3.7820 5.3594 5.0688 2.7986 4.0023 4.6267 9.3199 7.5966 3.7229 4.7177 2.8460 6.2550 2.3789 1.8297 2.9413 1.6920 1.4054 2.5979 2.3144 1.6219 2.5677 2.2791 4.1965 2.0899 2.2791 2.3733 1.9877 1.5053 2.0417 1.2342 2.1812 2.6950 1.8201 1.5553 1.5488 2.0560 1.3088 1.4926 1.4102 1.5593 1.6048 1.3889 1.4517 1.4757 2.3260 2.1509 1.5050 7.4016 5.5263 1.3558 1.0850 1.0907 1.0824 1.0931 3.6809 7.7545 7.9627 11.3401 1.0802 1.0651 1.0613 1.0645 1.0635 1.0880 1.0956 1.0992 1.1027 1.1005 1.0922 1.0932 1.0764 1.0662
irintensity: 1.0448 1.8512 0.6960 2.4929 0.4127 2.1850 1.0901 1.7737 2.5152 1.8853 4.6245 3.5921 6.0395 2.6094 8.3400 136.8950 8.0568 0.0975 1.1789 14.8617 5.4887 4.8127 11.6626 3.1705 0.9055 11.4501 12.3397 0.1772 10.4150 1.1487 4.5691 6.1157 62.0472 9.8274 54.5472 13.5233 17.5333 55.9107 0.3716 24.8699 2.3640 4.3785 13.3602 16.1671 3.0834 1.4084 16.7287 13.8791 6.1400 145.9956 3.5688 82.1785 18.7579 81.0805 11.4652 1.5318 71.4665 20.8868 38.4606 18.0686 5.6609 10.2962 7.6748 4.6201 4.2037 72.6207 45.0870 4.7373 42.9798 126.8535 4.2152 14.7828 9.6371 16.2756 11.5416 298.2487 10.4146 25.1894 176.5447 20.0780 38.2123 24.3304 55.7096 5.5308 18.2337 54.6427 38.7648 27.9443 78.9594 6.7770 0.6259 0.2498 46.3332
temp: 298.150 k
press: 1.00000 atm
elementType: 17 9 8 8 7 7 6 6 6 6 6 6 6 6 6 6 6 6 6 1 1 1 1 1 1 1 1 1 1 1 1 1 1
symmnumber: 1
zpe: 664427.5 jmol-1
zpe.correction: 0.253067 hartree
zpe.thermalcorrener: 0.269837 hartree
zpe.thermalcorrenthalpy: 0.270781 hartree
zpe.thermalcorrgfe: 0.208256 hartree
zpe.sumelectzpe: -1322.206792 hartree
zpe.sumelectthermal: -1322.190022 hartree
zpe.sumelectthermalent: -1322.189078 hartree
zpe.sumelectthermalfe: -1322.251602 hartree
dipole: -4.7411 0.9061 0.1933
dipole: 4.8307
quadrupole: -117.7811 -113.6733 -120.4106
quadrupole: -2.6943 -1.5349 -5.9803
quadrupole: -0.4928 3.6150 -3.1223 -2.6943 -1.5349 -5.9803
hfenergy: -1322.4598587 hartree
pointgroup: C01 [X(C13H14Cl1F1N2O2)]
dipole: -1.8669157 0.3473233 -0.0782146 debye
polarizability: 249.719896|4.8895517|157.4679253|16.5892891|-15.2925924|111.3893946 unknown
InChI: InChI=1S/C13H14ClFN2O2/c14-8-5-9(15)11(6-12(8)18)17-13(19)7-3-1-2-4-10(7)16-17/h5-7,10,16,18H,1-4H2
charge 0 multiplicity 1
33 atoms
Cl 5.495558 0.026197 0.611895
F  1.320572 2.417046 -1.321664
O  -1.020557 -2.020689 -0.837642
O  3.500986 -2.156982 1.075929
N  -1.13551 1.568062 -0.496777
N  -0.442729 0.276341 -0.615088
C  -2.581354 1.173697 -0.282732
C  -2.726061 -0.179153 -1.036022
C  -2.859791 1.054418 1.232151
C  -3.886742 -1.098219 -0.601544
C  -4.160624 0.274697 1.527047
C  -4.076953 -1.149268 0.931774
C  -1.327611 -0.796337 -0.831438
C  0.945196 0.205585 -0.338744
C  1.520551 -0.956388 0.236058
C  1.81599 1.280202 -0.644393
C  2.903168 -1.024924 0.516502
C  3.184882 1.247577 -0.347315
C  3.729375 0.091993 0.238719
H  -3.217408 1.959047 -0.729571
H  -2.817771 0.020371 -2.126287
H  -2.885949 2.069036 1.668876
H  -2.007791 0.529201 1.707876
H  -3.69458 -2.11231 -1.000021
H  -4.821276 -0.731813 -1.070668
H  -5.032696 0.808473 1.094632
H  -4.326234 0.22821 2.619851
H  -3.227944 -1.690784 1.394912
H  -4.991181 -1.725886 1.168084
H  -1.005964 2.077154 -1.391077
H  0.871843 -1.81399 0.43683
H  3.8142 2.105649 -0.595373
H  2.839605 -2.884315 1.188718
