program: Gaussian 09
title: 000183602
version: EM64L-G09RevD.01
frameworkgroup: C1[X(C20H17NO2)]
method: RPBEPBE
basis: SDD
operation: Freq
keyword: #p
keyword: freq=noraman
keyword: PBEPBE/SDD
title: #p freq=noraman PBEPBE/SDD
converged: YES YES NO NO
title: Mulliken charges:
elementType: O O N C C C C C C C C C C C C C C C C C C C C H H H H H H H H H H H H H H H H H
charge: -0.368035 -0.234276 -0.454151 0.270445 0.266353 -0.357062 -0.357030 0.410567 0.480346 -0.348205 -0.348501 0.448680 -0.379688 -0.384039 -0.443524 -0.342702 -0.367385 -0.382825 -0.217898 -0.217582 -0.239508 -0.808519 0.211362 0.248225 0.248217 0.247531 0.247542 0.248006 0.244150 0.221497 0.294985 0.230898 0.230822 0.333204 0.227557 0.226916 0.235488 0.222921 0.226187 0.229028
chargesum: 0.00000
title: Mulliken charges with hydrogens summed into heavy atoms:
elementType: O O N C C C C C C C C C C C C C C C C C C C C
charge: -0.368035 -0.234276 -0.120948 0.270445 0.266353 -0.108837 -0.108813 0.410567 0.480346 -0.100674 -0.100959 0.448680 -0.131682 -0.139889 -0.222026 -0.047717 -0.136487 -0.152002 0.009659 0.009334 -0.010479 -0.123923 0.211362
polarizability: 3.89007030e+02 -5.94496226e+00 1.93240103e+02 5.76316229e-01 1.67167925e-01 1.33009474e+02
1716.lowfreq: -67.4454 -26.6816 -19.5857 -3.7926 -3.2172 -0.0007 0.0003 0.0008 7.0442
frequency: -67.4182 -25.7888 -19.4304 21.2193 23.6301 50.6615 67.2642 72.3072 87.0209 134.3664 166.8941 172.7239 234.7659 277.0516 291.9153 312.5722 339.0042 373.9485 390.1073 398.7073 400.6819 405.7068 408.9999 491.7287 513.9130 535.0740 535.5803 599.6896 615.5105 629.8370 631.5386 645.2135 674.9052 689.9080 698.4777 706.1675 715.2536 744.2704 760.7813 770.0257 803.9527 821.1970 831.6322 843.3139 849.9133 853.6704 865.5223 920.1490 935.7029 943.5725 952.6245 965.0365 974.4896 981.2203 987.0373 988.1111 995.2387 995.6260 1008.7528 1013.8765 1040.9335 1046.9694 1077.3937 1101.2328 1126.4943 1137.1676 1163.8267 1172.0790 1186.5841 1190.9954 1195.3153 1224.2038 1261.8314 1286.2279 1289.0557 1309.2024 1315.5553 1354.0303 1368.8992 1370.7209 1396.3921 1398.3207 1412.6137 1428.4696 1467.4767 1471.7091 1473.2449 1496.1756 1505.1535 1520.8809 1583.9828 1585.6662 1596.1693 1608.2334 1618.1574 1630.3481 1693.2843 2973.3850 3054.1327 3083.5409 3111.0767 3122.4077 3127.1022 3128.6099 3138.0492 3140.7009 3141.0199 3142.4898 3149.5488 3164.3759 3164.7058 3169.0682 3185.4612 3540.9173
redmass: 3.8129 4.4199 1.0380 5.0750 5.7269 5.6706 5.1576 5.4651 5.0688 6.0225 4.1486 6.1130 5.9057 4.5943 4.6857 6.4554 3.9650 3.5641 5.4249 2.8466 5.4452 2.9008 2.9602 6.3017 2.5011 3.1019 3.3111 6.5493 6.2638 6.0038 6.6146 1.5308 5.0520 3.5483 5.7437 1.6996 3.0421 4.1355 5.0085 1.9579 6.0879 1.4700 1.2436 2.0093 1.2850 1.2413 4.1867 1.4033 7.1445 1.3407 1.4132 1.3677 1.3811 1.3357 5.6265 1.4607 1.3067 6.3980 2.9009 2.6507 1.8554 1.5450 1.5985 1.3288 1.7283 2.2988 1.5151 1.0528 1.1249 1.8138 1.1539 2.5931 2.2669 3.0087 1.2607 1.3716 1.3605 6.2059 6.7429 5.4147 3.6567 1.2268 3.4620 2.2184 1.4285 1.5383 1.0704 1.9899 2.6462 2.9242 6.0176 7.7725 5.0375 6.2301 6.5454 6.3796 9.7562 1.0389 1.0948 1.0996 1.0875 1.0844 1.0908 1.0877 1.0965 1.0923 1.0889 1.0889 1.0969 1.1018 1.0965 1.0976 1.0944 1.0760
irintensity: 0.0265 0.5900 0.5336 1.3926 0.3690 0.8316 1.7575 0.0443 0.0178 1.7710 3.3473 1.4786 7.1584 1.3510 4.8558 1.0532 0.4191 0.9427 4.0083 0.0013 1.8346 0.0285 0.0123 5.9035 33.8621 25.8517 11.9813 6.6401 0.4304 0.0011 1.1063 28.4003 2.7193 52.5035 1.2787 56.4435 0.2897 1.1687 0.6054 44.6006 1.2622 66.7647 0.2032 38.9197 18.5254 0.0083 27.1380 1.8886 326.0230 4.8333 16.7681 0.0957 0.0011 2.5243 1.2228 17.9388 0.1177 40.8325 0.3397 14.4454 10.4577 22.1786 7.9181 10.3823 342.1896 477.3051 40.7966 0.0285 4.0849 84.9364 2.4985 0.1528 3.2355 6.4321 0.5861 0.5434 26.8544 0.0664 0.0991 111.4424 3.1093 5.3006 53.3385 7.2264 253.0165 23.6171 11.8295 188.7770 24.8790 412.2108 1.4805 2.0713 37.8625 3.5479 4.6232 36.0902 290.0813 47.4528 24.1276 18.5120 19.0409 2.2161 23.3266 0.4405 18.4793 26.7631 3.8186 8.6518 38.2644 26.8899 11.2013 1.3854 2.6902 33.1644
temp: 298.150 k
press: 1.00000 atm
elementType: 8 8 7 6 6 6 6 6 6 6 6 6 6 6 6 6 6 6 6 6 6 6 6 1 1 1 1 1 1 1 1 1 1 1 1 1 1 1 1 1
symmnumber: 1
zpe: 823985.7 jmol-1
zpe.correction: 0.313840 hartree
zpe.thermalcorrener: 0.331438 hartree
zpe.thermalcorrenthalpy: 0.332382 hartree
zpe.thermalcorrgfe: 0.266125 hartree
zpe.sumelectzpe: -975.954573 hartree
zpe.sumelectthermal: -975.936974 hartree
zpe.sumelectthermalent: -975.936030 hartree
zpe.sumelectthermalfe: -976.002287 hartree
dipole: 0.6773 -1.7062 0.0521
dipole: 1.8364
quadrupole: -101.0917 -125.6816 -133.7104
quadrupole: -4.8345 0.4321 0.0508
quadrupole: 19.0695 -5.5204 -13.5491 -4.8345 0.4321 0.0508
hfenergy: -976.2684124 hartree
pointgroup: C01 [X(C20H17N1O2)]
dipole: 0.2739095 0.6682402 -0.021136 debye
polarizability: 389.1153254|3.769292|193.1325444|-0.476413|0.1072519|133.008738 unknown
InChI: InChI=1S/C20H17NO2/c1-15-7-11-18(12-8-15)21-20(22)23-19-13-9-17(10-14-19)16-5-3-2-4-6-16/h2-14,21H,1H3
charge 0 multiplicity 1
40 atoms
O  0.756508 1.273407 -0.0040
O  1.504332 -0.982368 0.000899
N  2.976449 0.880896 -0.000836
C  -3.364495 0.22003 -0.001897
C  -4.824035 -0.135931 -0.001093
C  -2.660117 0.387282 1.219122
C  -2.661334 0.387055 -1.223644
C  -0.616363 0.869217 -0.003347
C  4.269894 0.284173 0.002766
C  -1.285771 0.711324 1.224852
C  -1.286954 0.711016 -1.230839
C  6.926547 -0.777071 0.013897
C  -5.232293 -1.49553 -0.000733
C  -5.818146 0.877271 -0.000613
C  5.392747 1.151919 0.005708
C  4.474334 -1.119504 0.008136
C  6.69861 0.623147 0.012617
C  5.790806 -1.626064 0.015143
C  -6.604729 -1.834307 0.000066
C  -7.190875 0.538802 0.000204
C  -7.588284 -0.818244 0.00054
C  8.335305 -1.344431 -0.009841
C  1.753184 0.241786 -0.001061
H  -3.192015 0.259135 2.167966
H  -3.194189 0.258735 -2.171927
H  -0.737122 0.83871 2.163234
H  -0.739225 0.838171 -2.169785
H  -4.471241 -2.284093 -0.001083
H  -5.511707 1.929604 -0.000855
H  5.24509 2.239635 0.007298
H  3.6143 -1.792639 0.011056
H  7.553352 1.310234 0.018204
H  5.935221 -2.713387 0.022733
H  2.928725 1.902243 -0.002549
H  -6.904794 -2.888358 0.00033
H  -7.947002 1.332105 0.000589
H  8.687288 -1.499443 -1.048598
H  9.054592 -0.665614 0.48165
H  8.38615 -2.321865 0.501516
H  -8.652147 -1.081049 0.001176
