program: Gaussian 09
title: 000183599
version: EM64L-G09RevD.01
frameworkgroup: C1[X(C19H14N2O4)]
method: RPBEPBE
basis: SDD
operation: Freq
keyword: #p
keyword: freq=noraman
keyword: PBEPBE/SDD
title: #p freq=noraman PBEPBE/SDD
converged: NO YES NO NO
title: Mulliken charges:
elementType: O O O O N N C C C C C C C C C C C C C C C C C C C H H H H H H H H H H H H H H
charge: -0.359828 -0.219759 -0.216932 -0.212646 -0.456699 0.021161 0.268901 0.268166 -0.354028 -0.353994 0.414776 -0.349043 -0.349217 -0.380234 -0.382617 0.509477 -0.216841 -0.216965 -0.420913 -0.312740 0.391282 -0.238161 -0.342863 -0.361711 0.223249 0.251732 0.251734 0.249053 0.249064 0.247712 0.244159 0.229325 0.228687 0.237362 0.307784 0.343464 0.230893 0.288904 0.288308
chargesum: 0.00000
title: Mulliken charges with hydrogens summed into heavy atoms:
elementType: O O O O N N C C C C C C C C C C C C C C C C C C C
charge: -0.359828 -0.219759 -0.216932 -0.212646 -0.113235 0.021161 0.268901 0.268166 -0.102296 -0.102261 0.414776 -0.099989 -0.100153 -0.132522 -0.138457 0.509477 0.012483 0.011722 -0.183551 -0.004956 0.391282 -0.007268 -0.053959 -0.073403 0.223249
polarizability: 4.37136306e+02 1.57586524e+00 2.04394311e+02 -3.20596840e-02 3.15686488e-02 1.27710654e+02
1716.lowfreq: -67.1887 -23.3952 -4.8052 -2.9752 -0.0010 -0.0004 0.0009 6.0271 18.6104
frequency: -67.1563 -23.1312 18.5308 21.5026 44.8284 59.3708 67.3201 81.4155 85.3226 123.0669 147.1067 158.9107 210.9409 247.1993 277.2791 296.0435 308.6499 347.4390 391.0500 397.9297 398.8089 404.7636 414.6253 416.4881 503.4446 508.2356 535.1173 535.7707 568.9879 615.2560 621.7701 629.5975 646.6571 655.5485 667.1051 681.8334 705.2846 706.1427 710.0028 736.5013 744.3253 769.8962 769.9605 801.6573 831.1428 837.1710 843.1550 853.6351 865.7632 875.2532 920.5369 947.2239 954.9204 966.0928 974.7500 980.4997 987.4702 995.2980 996.3570 999.0524 1005.7153 1013.8588 1041.2674 1078.3743 1095.8147 1102.7524 1119.3818 1131.3664 1161.9051 1172.9202 1181.7931 1187.0288 1188.8861 1225.4551 1271.2098 1286.9717 1289.8542 1303.8361 1309.6381 1356.3294 1358.8124 1370.1086 1396.3431 1396.6743 1429.2105 1430.1541 1470.4008 1485.0870 1500.7782 1521.2625 1584.8173 1588.6565 1599.5697 1608.2214 1615.8313 1618.6452 1688.0152 3124.3586 3129.8719 3133.8318 3141.7894 3144.0015 3145.2414 3150.9223 3166.0175 3166.1594 3170.4957 3178.4888 3186.6698 3196.9114 3532.0098
redmass: 3.7943 4.4554 7.8172 7.3903 9.0276 9.9019 6.3246 5.5881 5.5068 7.8705 6.5389 7.9032 7.3629 8.3755 4.6127 7.4894 5.7411 6.6668 5.5150 2.8455 5.9808 2.8925 7.8622 3.0120 3.0595 7.4203 3.3202 3.1094 7.6135 6.3310 6.7756 6.3547 7.2757 1.8099 4.4878 5.0614 2.6639 1.7128 6.6108 4.5420 4.2087 1.9551 7.9342 7.3627 1.2441 1.3531 1.9824 1.2413 4.2337 1.5185 1.3996 3.3763 1.8217 1.3681 1.3814 1.3409 6.2210 6.6670 1.3085 3.0857 1.3212 2.6799 1.8563 1.5970 3.0154 1.3274 1.3826 3.5340 1.7028 1.0528 1.4385 1.1591 1.5955 4.3141 1.9701 2.9812 1.2602 1.4271 1.3700 6.2549 7.4540 6.7619 6.2743 3.6405 2.2224 4.6053 2.1747 2.2524 2.9197 2.6095 6.0200 7.8056 6.2460 6.2951 6.1049 6.5428 8.9474 1.0846 1.0878 1.0909 1.0925 1.0889 1.0888 1.0969 1.1018 1.0968 1.0978 1.0899 1.0947 1.0966 1.0762
irintensity: 0.0127 0.7051 0.0484 0.3244 0.2017 4.6352 0.5942 1.3111 0.3725 2.0743 0.0079 1.2978 2.2796 8.5830 0.8238 2.5880 2.0778 0.4890 4.4127 0.0015 5.0937 0.0150 5.3226 0.0393 20.5648 0.6927 11.9395 25.4465 3.0187 0.1716 1.8417 0.1136 0.0040 10.6160 33.5264 0.7366 38.8845 69.3213 7.0738 12.3459 1.7321 45.1497 11.0018 20.1827 0.0001 29.8472 40.9107 0.0021 27.2626 71.9893 1.8407 207.7174 100.3028 0.0688 0.0007 0.7901 0.1383 70.8369 0.1118 0.0968 0.0200 22.6570 9.4605 7.8273 29.8580 10.4161 169.1451 1252.0656 57.8456 0.0315 132.9616 7.8358 42.7120 337.8235 3.7869 4.5880 0.5449 28.2151 0.5839 0.0364 94.6386 0.1001 288.4821 3.6879 7.5090 65.8727 163.0833 5.8670 200.3852 489.7171 1.5488 2.2754 55.8193 4.8286 300.5164 1.0094 202.1303 2.5206 0.1088 10.9299 21.0079 2.8227 12.1418 36.7755 26.5723 9.4308 1.1396 2.5580 3.0137 2.6994 46.9878
temp: 298.150 k
press: 1.00000 atm
elementType: 8 8 8 8 7 7 6 6 6 6 6 6 6 6 6 6 6 6 6 6 6 6 6 6 6 1 1 1 1 1 1 1 1 1 1 1 1 1 1
symmnumber: 1
zpe: 757318.2 jmol-1
zpe.correction: 0.288447 hartree
zpe.thermalcorrener: 0.307596 hartree
zpe.thermalcorrenthalpy: 0.308540 hartree
zpe.thermalcorrgfe: 0.238134 hartree
zpe.sumelectzpe: -1141.029710 hartree
zpe.sumelectthermal: -1141.010562 hartree
zpe.sumelectthermalent: -1141.009617 hartree
zpe.sumelectthermalfe: -1141.080023 hartree
dipole: 6.8558 -3.7588 0.0038
dipole: 7.8186
quadrupole: -188.3821 -136.7122 -140.6068
quadrupole: 19.5490 -0.0249 0.0239
quadrupole: -33.1484 18.5215 14.6269 19.5490 -0.0249 0.0239
hfenergy: -1141.3181573 hartree
pointgroup: C01 [X(C19H14N2O4)]
dipole: -2.7078061 -1.4594872 -0.000329 debye
polarizability: 437.1017968|-3.2424965|204.4287234|-0.0341327|-0.0912497|127.7107503 unknown
InChI: InChI=1S/C19H14N2O4/c22-19(20-16-8-10-17(11-9-16)21(23)24)25-18-12-6-15(7-13-18)14-4-2-1-3-5-14/h1-13,20H
charge 0 multiplicity 1
39 atoms
O  0.038296 -1.37697 -0.000332
O  0.914379 0.827326 0.000265
O  8.589256 -0.145516 -0.000191
O  7.868008 2.02042 0.000531
N  2.272698 -1.122617 -0.000194
N  7.651698 0.745887 0.000161
C  -4.034905 -0.152246 -0.000012
C  -5.482714 0.247547 0.000064
C  -3.337916 -0.343638 -1.221631
C  -3.338967 -0.347965 1.221519
C  -1.319538 -0.908301 -0.000188
C  -1.97771 -0.721878 -1.22917
C  -1.978753 -0.726193 1.228877
C  -5.852937 1.617621 -0.001405
C  -6.502913 -0.739005 0.001588
C  3.58691 -0.606909 -0.000083
C  -7.215678 1.992719 -0.00133
C  -7.865592 -0.36373 0.001639
C  4.657184 -1.547454 -0.000334
C  3.86867 0.788717 0.000266
C  6.250375 0.278226 0.000129
C  -8.225887 1.003432 0.000187
C  5.98934 -1.110745 -0.000241
C  5.203661 1.226172 0.000367
C  1.078076 -0.409038 0.000001
H  -3.864897 -0.194605 -2.169902
H  -3.866737 -0.202222 2.169863
H  -1.436406 -0.872427 -2.168283
H  -1.438215 -0.880012 2.167903
H  -5.071373 2.385789 -0.002549
H  -6.225303 -1.799255 0.002675
H  -7.487386 3.054241 -0.002436
H  -8.642715 -1.136221 0.002786
H  4.43977 -2.622048 -0.000602
H  3.045792 1.505848 0.000461
H  2.160219 -2.139732 -0.000445
H  -9.282112 1.294829 0.000233
H  6.824436 -1.815503 -0.000427
H  5.447779 2.291657 0.000637
