program: Gaussian 09
title: 000183598
version: EM64L-G09RevD.01
frameworkgroup: C1[X(C14H14ClF3N2O2)]
method: RPBEPBE
basis: SDD
operation: Freq
keyword: #p
keyword: freq=noraman
keyword: PBEPBE/SDD
title: #p freq=noraman PBEPBE/SDD
converged: NO YES NO NO
title: Mulliken charges:
elementType: Cl F F F O O N N C C C C C C C C C C C C C C H H H H H H H H H H H H H H
charge: 0.017174 -0.195600 -0.154220 -0.192255 -0.225783 -0.216764 -0.238899 -0.304042 -0.213612 -0.231863 -0.405060 -0.433255 -0.377373 -0.408491 0.127972 0.430611 -0.454994 0.157219 0.498590 -0.333009 -0.339184 0.147724 0.251578 0.256474 0.225759 0.211880 0.238282 0.204159 0.188771 0.210192 0.216808 0.211661 0.288819 0.322472 0.286949 0.231310
chargesum: 0.00000
title: Mulliken charges with hydrogens summed into heavy atoms:
elementType: Cl F F F O O N N C C C C C C C C C C C C C C
charge: 0.017174 -0.195600 -0.154220 -0.192255 -0.225783 -0.216764 0.049921 -0.304042 0.037966 0.024611 0.032579 0.009185 0.021590 0.019979 0.127972 0.430611 -0.132521 0.157219 0.498590 -0.046060 -0.339184 0.379034
polarizability: 2.58289605e+02 9.99578020e+00 1.84074086e+02 -1.07454677e+01 -5.58434236e+00 1.15621250e+02
1716.lowfreq: -6.0700 -0.0020 -0.0018 -0.0008 6.5945 9.4498 27.0150 29.5272 47.2948
frequency: 26.6917 29.2710 47.2854 57.9935 64.5780 81.7570 102.7763 129.7160 134.0514 167.7653 192.3162 204.4593 216.0791 246.7924 283.4521 296.0447 315.0257 325.9224 329.6036 359.9318 399.7554 407.4676 441.5721 443.5265 459.7796 488.0747 492.0261 532.5882 550.9647 564.8561 615.1081 628.9702 647.7801 672.3145 682.8604 700.5575 745.2296 779.1354 784.6802 811.4023 819.9114 842.2493 859.7534 860.9054 883.6795 913.5611 925.4721 928.5743 966.0223 975.4351 1006.2355 1030.7462 1039.0991 1061.2945 1067.2667 1082.4553 1083.3408 1113.4645 1121.9502 1149.8009 1169.9847 1204.1007 1219.3396 1224.2576 1244.5640 1257.1190 1272.8716 1290.5760 1295.6223 1306.3498 1310.4256 1311.3084 1335.4425 1341.6173 1344.1360 1351.4716 1357.9426 1376.3342 1394.3979 1416.8360 1458.9523 1463.3326 1471.5902 1476.2510 1497.7996 1588.6246 1610.5392 1633.7255 2950.3353 2969.1888 2981.9180 2987.4879 2989.3399 3033.4131 3040.3850 3041.2375 3052.2840 3061.3427 3062.1390 3187.6666 3189.5858 3327.9273
redmass: 5.7191 7.1596 7.4712 8.5603 8.4428 9.6979 4.9618 4.8098 5.4356 11.1471 6.5784 6.2058 5.5232 3.3573 8.8990 8.8521 5.7001 11.5074 2.0242 2.7967 10.1600 3.9849 8.8731 3.6276 3.0857 9.7006 5.7474 5.8773 2.5547 6.3590 7.0576 4.7256 9.5301 8.0433 4.3586 4.1452 2.7892 2.9752 4.5559 2.3403 2.2578 1.6002 1.9235 1.9169 2.1895 1.7002 6.0435 2.8872 2.3116 4.3496 2.0426 7.2235 5.2799 1.9225 2.8643 1.8847 1.5307 1.2245 3.3932 2.5208 2.0653 1.5420 3.5050 1.6165 1.3068 1.3673 1.3669 1.1549 1.5682 1.5128 1.3036 1.3905 1.7305 2.9530 1.4880 1.5121 1.4705 6.8411 5.6428 1.3702 1.0845 1.0907 1.0833 1.0924 3.8255 9.1212 8.1120 11.4844 1.0802 1.0656 1.0613 1.0646 1.0630 1.0882 1.0954 1.0991 1.1028 1.0887 1.1002 1.0925 1.0934 1.0762
irintensity: 1.2943 0.0996 1.6767 0.8783 1.8736 0.2919 2.4952 1.1061 2.0151 2.0019 4.9380 0.7178 3.7766 3.5878 1.4917 0.2333 2.1053 1.2705 8.1491 7.5107 3.4536 1.0821 4.0833 7.6002 5.3265 5.5633 12.0171 5.5870 0.8927 7.0988 6.8298 12.5294 0.8495 10.0264 1.6707 4.3304 4.7382 17.8925 25.7716 34.5165 36.9405 5.1015 31.0503 15.4020 28.2155 7.2082 179.3727 44.5147 22.0934 10.5902 2.8388 102.7911 464.5738 3.9445 46.7865 7.6039 5.4737 1.7558 4.5061 79.2162 68.7760 10.0831 132.7584 18.5811 10.5158 16.4670 5.3390 19.7454 10.8363 47.7696 37.0850 28.2189 24.9911 55.0137 6.3915 8.0472 2.6759 33.2222 137.3670 7.1698 15.3709 9.5473 15.5063 11.0468 368.9402 2.3443 31.2615 158.9679 19.5933 36.8037 23.0327 51.9984 9.2259 16.9357 52.7747 35.4291 29.8410 23.0976 75.0706 5.8663 0.3654 0.2458
temp: 298.150 k
press: 1.00000 atm
elementType: 17 9 9 9 8 8 7 7 6 6 6 6 6 6 6 6 6 6 6 6 6 6 1 1 1 1 1 1 1 1 1 1 1 1 1 1
symmnumber: 1
zpe: 695575.5 jmol-1
zpe.correction: 0.264931 hartree
zpe.thermalcorrener: 0.284667 hartree
zpe.thermalcorrenthalpy: 0.285611 hartree
zpe.thermalcorrgfe: 0.214895 hartree
zpe.sumelectzpe: -1559.762611 hartree
zpe.sumelectthermal: -1559.742875 hartree
zpe.sumelectthermalent: -1559.741931 hartree
zpe.sumelectthermalfe: -1559.812647 hartree
dipole: 5.4671 -3.0719 -1.0989
dipole: 6.3666
quadrupole: -127.1381 -139.9359 -135.3957
quadrupole: 4.1605 3.5892 1.6815
quadrupole: 7.0184 -5.7793 -1.2391 4.1605 3.5892 1.6815
hfenergy: -1560.027542 hartree
pointgroup: C01 [X(C14H14Cl1F3N2O2)]
dipole: 2.1908374 -0.9048106 -0.8097553 debye
polarizability: 255.3133499|18.0258592|184.5027013|-13.9269148|10.7324879|118.1688885 unknown
InChI: InChI=1S/C14H14ClF3N2O2/c15-8-5-9(16)11(6-12(8)22-14(17)18)20-13(21)7-3-1-2-4-10(7)19-20/h5-7,10,14,19H,1-4H2
charge 0 multiplicity 1
36 atoms
Cl -4.80528 -1.794395 0.263393
F  -0.072236 -3.20349 -1.303897
F  -4.303747 2.878769 0.673831
F  -2.20822 2.639208 1.531453
O  1.040869 1.637219 -1.224232
O  -3.424082 0.806874 0.733548
N  2.071668 -1.717654 -0.38187
N  1.0774 -0.674931 -0.677493
C  3.346192 -0.924081 -0.170923
C  3.183157 0.315855 -1.096517
C  3.477073 -0.550513 1.322117
C  4.033461 1.557064 -0.753037
C  4.506168 0.579317 1.552038
C  4.096923 1.844677 0.764531
C  1.66322 0.559468 -1.024781
C  -0.294681 -0.928369 -0.4534
C  -1.150727 0.08619 0.046259
C  -0.867833 -2.192542 -0.729257
C  -2.52281 -0.170805 0.23797
C  -2.218256 -2.479717 -0.49183
C  -3.055229 -1.458524 -0.00822
C  -3.106293 2.160821 0.515201
H  4.195188 -1.557549 -0.485005
H  3.396885 0.015397 -2.145786
H  3.736716 -1.459593 1.893929
H  2.487454 -0.217338 1.693422
H  3.61426 2.426572 -1.293565
H  5.061034 1.39706 -1.13522
H  5.515227 0.248467 1.228302
H  4.576189 0.802353 2.633132
H  3.107305 2.19468 1.120607
H  4.811956 2.668016 0.950681
H  2.141731 -2.325894 -1.220208
H  -0.722609 1.059744 0.292169
H  -2.61081 -3.47464 -0.71431
H  -2.652765 2.375283 -0.469437
