program: Gaussian 09
title: 000185003
version: EM64L-G09RevD.01
frameworkgroup: C1[X(C8H9NO)]
method: RPBEPBE
basis: SDD
operation: Freq
keyword: #pfreq=noraman
keyword: PBEPBE/SDD
title: #p freq=noraman PBEPBE/SDD
converged: YES YES NO NO
title: Mulliken charges:
elementType: O N C C C C C C C C H H H H H H H H H
charge: -0.193175 0.073238 -0.186793 -0.186830 -0.209396 -0.451889 -0.451957 -0.204175 -0.204223 -0.059904 0.256937 0.257000 0.264607 0.215028 0.222088 0.222119 0.215027 0.211148 0.211151
chargesum: 0.00000
title: Mulliken charges with hydrogens summed into heavy atoms:
elementType: O N C C C C C C C C
charge: -0.193175 0.073238 0.070144 0.070169 0.055211 -0.014773 -0.014811 0.006973 0.006928 -0.059904
polarizability: 1.20180601e+02 -1.13939629e-02 8.37376458e+01 -7.50070790e+00 -5.16250316e-04 6.17004314e+01
1716.lowfreq: -24.5105 -14.5827 -9.1070 -0.0003 -0.0002 0.0003 32.4806 53.9774 105.1849
frequency: 31.7430 53.9718 105.1847 236.5772 240.7119 313.7094 378.2644 385.7339 470.7594 512.5447 525.5228 545.9163 665.0592 753.8354 779.6271 795.3765 875.5683 888.0319 937.5642 951.9446 967.2258 987.0842 1010.4273 1047.1558 1061.1281 1070.8522 1108.1752 1180.6671 1205.0510 1205.6101 1210.4784 1297.1160 1321.3419 1336.9934 1342.0071 1384.8019 1408.2738 1451.2691 1457.9100 1464.1545 1677.6953 2338.3276 2957.1187 2957.3570 2997.2534 2997.9619 3100.4841 3111.4393 3122.8586 3130.8765 3133.7652
redmass: 7.3029 6.7092 2.7683 2.7162 3.6641 3.1374 6.6880 1.9883 12.1784 10.0244 5.5233 4.8651 1.1848 4.1224 3.6104 2.0915 2.4820 2.9442 2.7242 2.7112 1.7516 1.5491 2.1364 1.3104 1.5900 1.3268 1.3794 1.1348 1.1634 1.2595 1.1823 1.4307 1.3537 2.1000 1.5952 1.5495 2.3504 2.1664 1.0739 1.8033 6.3887 12.6412 1.0607 1.0608 1.0984 1.0984 1.0840 1.0884 1.0938 1.0931 1.0928
irintensity: 0.0991 1.5388 0.7758 2.5951 0.2043 3.2728 6.5886 0.9518 12.2452 16.6769 0.0854 2.7797 55.3191 21.2555 5.0414 17.1530 7.4073 1.3387 0.9514 10.4232 0.6643 0.6707 11.2261 10.3155 13.1670 1.6888 3.5844 3.2343 3.0440 0.1870 5.6255 1.6056 0.9079 0.3749 3.0819 0.2751 6.6058 3.3507 18.0230 6.0578 6.1973 936.8199 32.6411 52.7810 15.9213 34.6750 5.9855 8.8368 11.4510 75.9275 1.4838
temp: 298.150 k
press: 1.00000 atm
elementType: 8 7 6 6 6 6 6 6 6 6 1 1 1 1 1 1 1 1 1
symmnumber: 1
zpe: 397701.5 jmol-1
zpe.correction: 0.151477 hartree
zpe.thermalcorrener: 0.160619 hartree
zpe.thermalcorrenthalpy: 0.161563 hartree
zpe.thermalcorrgfe: 0.115900 hartree
zpe.sumelectzpe: -439.439414 hartree
zpe.sumelectthermal: -439.430271 hartree
zpe.sumelectthermalent: -439.429327 hartree
zpe.sumelectthermalfe: -439.474991 hartree
dipole: 4.1647 -0.0005 0.3756
dipole: 4.1816
quadrupole: -74.9193 -54.2580 -57.6143
quadrupole: 0.0007 -0.7034 -0.0018
quadrupole: -12.6554 8.0059 4.6495 0.0007 -0.7034 -0.0018
hfenergy: -439.5908904 hartree
pointgroup: C01 [X(C8H9N1O1)]
dipole: -1.6292646 0.2151865 -0.0760582 debye
dipolederiv: -1.6413195 0.2390954 0.25775 0.2664896 -0.3095383 -0.048965 0.4138811 -0.0709377 -0.3358739 -1.4528736 0.1923174 0.1582771 0.2642623 -0.3293837 -0.0575569 0.5651864 -0.1146488 -0.4815893 0.0324743 -0.0245652 -0.0103819 -0.0953378 -0.0766168 -0.0539611 0.036596 -0.0468029 0.0950096 0.0580818 -0.0078096 0.0092 0.0740943 -0.0498163 0.1031284 0.0260096 0.0869142 0.0422326 0.7385761 -0.0709485 -0.0031272 -0.1237244 0.2513855 -0.013494 -0.3016063 0.028517 0.1577432 0.0678761 0.0251701 0.0929897 0.0590492 0.0032857 -0.0567151 0.0452347 -0.0959552 0.1496547 0.0500876 0.0069707 0.1139533 -0.0391188 0.0789409 0.0552927 0.0927314 0.1042956 0.0917483 -0.0001129 -0.0797079 -0.1704594 -0.1211993 0.1025989 0.0341887 -0.1802057 0.110198 -0.1410286 0.04086 0.0220819 -0.2014036 0.0542829 0.0065925 -0.0400083 -0.2445864 -0.108695 -0.0859299 2.3593309 -0.3953627 -0.5710688 -0.4398234 0.345571 0.1179177 -0.8233604 0.1533586 0.4763964 -0.0435098 0.0582916 0.072235 0.0241757 -0.0145965 -0.0737821 0.0582938 -0.0825074 0.0391699 -0.0547085 -0.0076751 0.1026304 0.0202155 0.0452096 0.0469583 0.0807481 0.0607137 -0.0094078 -0.0082581 0.0212605 0.0386112 0.0201029 0.0865567 -0.0282297 0.0321825 -0.0272922 -0.0339651 0.0323683 0.0435695 -0.00313 0.0062345 -0.0723916 0.1008914 0.0327083 0.1584568 -0.0361679 -0.044969 -0.0254173 -0.0675626 -0.0529891 -0.0033718 -0.071397 -0.0677056 -0.141297 -0.0318313 -0.0253057 0.0199766 -0.0563949 0.0492063 0.048483 0.0564462 -0.0470655 0.1250069 -0.1033554 0.0098887 -0.0812152 -0.0051497 -0.0367316 -0.130399 -0.0601965 -0.0008272 -0.1233985 0.0443416 -0.0776717 -0.022652 0.1376868 -0.0360151 0.0424989 0.0347739 0.1600961 0.0324181 0.0660938 -0.0408149 0.0866199 0.1053447 0.1068261 -0.0250087 -0.0452918 0.121689 -0.0483442 0.0967591 unknown
polarizability: 118.2526687|-6.6552523|84.2762764|-10.2433479|-2.2247491|63.0897337 unknown
InChI: InChI=1S/C8H9NO/c10-5-9-8-6-3-1-2-4-7(6)8/h1-2,6-8H,3-4H2
charge 0 multiplicity 1
19 atoms
O  4.102298 -0.689593 -0.329485
N  1.87013 -0.224639 0.527812
C  -0.42698 -0.865314 -0.448092
C  -0.215464 0.638175 -0.714998
C  0.46967 -0.033991 0.494121
C  -1.779818 -1.369215 0.052958
C  -1.358245 1.624582 -0.478573
C  -2.680191 -0.270427 0.588746
C  -2.493434 1.055285 0.353563
C  2.958104 -0.462992 0.044123
H  0.112874 -1.552607 -1.11043
H  0.457376 0.889697 -1.543474
H  0.048641 0.199752 1.477293
H  -1.631962 -2.146794 0.830231
H  -2.30133 -1.879826 -0.784371
H  -1.76341 1.942198 -1.4628
H  -0.970403 2.549064 -0.003659
H  -3.542821 -0.592531 1.187722
H  -3.208735 1.779275 0.766914
