program: Gaussian 09
title: 000185001
version: EM64L-G09RevD.01
frameworkgroup: C1[X(C7H11N2O3P)]
method: RPBEPBE
basis: SDD
operation: Freq
keyword: #p
keyword: freq=noraman
keyword: PBEPBE/SDD
title: #p freq=noraman PBEPBE/SDD
converged: YES YES NO NO
title: Mulliken charges:
elementType: P O O O N N C C C C C C C H H H H H H H H H H H
charge: 1.404752 -0.477805 -0.544419 -0.587013 -0.831864 -0.068692 0.237944 -0.289710 -0.170161 -0.190977 -0.329749 -0.492453 -0.480331 0.382045 0.273627 0.239717 0.233086 0.244567 0.242021 0.236442 0.241586 0.254469 0.232888 0.240030
chargesum: 0.00000
title: Mulliken charges with hydrogens summed into heavy atoms:
elementType: P O O O N N C C C C C C C
charge: 1.404752 -0.477805 -0.544419 -0.587013 -0.449819 -0.068692 0.237944 -0.016083 0.069557 0.042109 -0.089719 0.230576 0.248612
polarizability: 1.69270522e+02 -4.73650585e+00 9.06312547e+01 -5.98191451e-01 1.10438887e+01 1.04086288e+02
1716.lowfreq: -12.7888 -9.4806 -0.0008 -0.0005 0.0014 3.0354 21.5303 39.7639 54.3628
frequency: 9.7507 38.9935 54.2312 58.7683 81.5207 89.6716 109.3681 156.1384 167.0017 197.7007 251.4369 271.1522 291.1018 340.2660 404.0055 406.4018 469.4255 501.1463 571.1070 587.5900 612.4208 630.8273 680.8045 737.5479 772.1735 783.8754 873.2048 895.6792 949.9515 955.1682 963.8193 978.6910 987.9941 1040.9151 1071.1847 1090.4330 1112.6414 1116.2892 1127.4675 1136.7514 1172.3983 1231.4167 1311.5691 1331.8785 1375.0247 1425.4309 1426.6615 1429.6957 1457.5649 1458.2155 1467.4155 1472.2279 1475.5148 1568.4865 1592.4071 2983.3828 2989.9531 3083.5549 3092.2679 3128.4205 3133.1897 3135.1940 3144.3330 3160.4438 3178.0968 3529.6508
redmass: 4.7380 3.5744 3.0898 1.0733 3.9379 1.6811 1.7658 4.5856 4.9803 4.9211 5.4681 7.1146 5.9413 7.4110 4.9244 4.1987 7.6200 2.0106 6.0132 2.5754 2.7580 6.1161 7.3699 1.8628 4.0532 2.6511 1.3556 4.3603 1.4318 6.5024 11.1196 10.6246 1.3385 2.3832 9.5816 1.6601 1.2471 1.2432 1.2890 1.3228 1.0936 1.5532 1.7608 5.2794 1.8273 1.4032 1.5584 1.1332 1.0624 1.0507 1.9022 1.1082 1.1327 5.6653 5.8216 1.0297 1.0297 1.1050 1.1056 1.1030 1.1038 1.0884 1.0896 1.0957 1.1012 1.0751
irintensity: 1.6293 0.5801 6.3077 0.4002 2.5455 2.5429 1.8191 5.1482 20.3423 0.6012 8.3509 10.7084 4.8433 20.1687 3.5520 11.9326 65.4309 33.9466 8.9790 13.5310 93.0419 61.2382 139.7360 14.6205 17.2038 125.3759 0.7629 124.9370 0.5485 33.4794 149.8588 257.2101 0.4626 14.6075 111.1070 14.2797 0.7955 0.7443 0.5182 0.7668 2.9861 8.5467 97.8753 18.8354 135.2179 21.8866 26.0515 1.3294 1.1733 14.0656 246.0902 56.3547 22.2672 22.0565 237.3966 41.8345 54.2200 32.3520 27.4489 12.4299 12.4854 14.5912 10.0936 11.2516 18.2398 70.6346
temp: 298.150 k
press: 1.00000 atm
elementType: 15 8 8 8 7 7 6 6 6 6 6 6 6 1 1 1 1 1 1 1 1 1 1 1
symmnumber: 1
zpe: 474492.9 jmol-1
zpe.correction: 0.180725 hartree
zpe.thermalcorrener: 0.195506 hartree
zpe.thermalcorrenthalpy: 0.196450 hartree
zpe.thermalcorrgfe: 0.135742 hartree
zpe.sumelectzpe: -948.727207 hartree
zpe.sumelectthermal: -948.712426 hartree
zpe.sumelectthermalent: -948.711481 hartree
zpe.sumelectthermalfe: -948.772189 hartree
dipole: 0.2601 1.0467 -2.5901
dipole: 2.8057
quadrupole: -63.8886 -82.8936 -90.0955
quadrupole: -4.9088 -8.7236 -1.6114
quadrupole: 15.0706 -3.9344 -11.1363 -4.9088 -8.7236 -1.6114
hfenergy: -948.9079318 hartree
pointgroup: C01 [X(C7H11N2O3P1)]
dipole: 0.1670132 0.1893947 -1.074579 debye
dipolederiv: 2.862425 -0.1405007 -0.0164127 0.1665731 1.8940719 -0.531351 0.2558184 -0.1459789 1.562886 -0.7243955 -0.0237077 0.0519096 -0.1830018 -0.7841353 0.431864 0.1015688 0.4300715 -0.9845452 -1.4543215 0.4222759 -0.0758084 0.4710792 -0.795148 0.1079242 0.0584454 -0.0283233 -0.542167 -0.8035578 0.0310663 -0.0034136 -0.0221533 -0.5964263 0.0613295 -0.0434846 0.026019 -0.6485074 -2.2011059 0.1766389 0.0352064 0.1767305 -0.6261915 0.1429856 -0.1016287 0.0866265 -0.5639899 -0.9668597 0.1466258 0.0506351 -0.1359331 -0.2920911 -0.0649733 -0.2550102 -0.02551 -0.3016111 1.9710901 -0.2547377 -0.006433 -0.7505458 0.238214 -0.0106726 -0.4126416 0.031421 0.1366639 -0.434515 0.029579 -0.0125112 0.4318548 -0.1842127 0.0168837 0.4030415 -0.0312236 -0.1073038 0.3636384 -0.0098397 0.0737845 -0.0602374 0.0565054 0.1569175 0.0337046 0.1701916 0.0829676 -0.1689326 -0.0252675 -0.0077504 -0.1213491 -0.2369539 -0.1034117 -0.1346534 -0.0838553 -0.2676058 0.395342 -0.1120625 -0.0246473 0.0947481 0.147821 0.2390398 0.1958499 0.1991111 0.168503 0.3087873 -0.0251726 -0.0060167 0.0054199 0.1842634 -0.0332871 -0.1578738 -0.3035075 0.6155903 0.833319 -0.2559161 0.0639836 -0.0982356 0.2889795 -0.027968 0.2961094 -0.1753999 0.2228121 0.1478582 -0.0385633 -0.044085 0.0557991 0.2796716 -0.0307704 -0.0441469 -0.0501207 0.2737464 0.0462987 -0.0298876 -0.0635423 -0.0535539 0.1205015 -0.04664 -0.0795959 -0.0573646 0.0880255 0.0782346 0.0360897 0.0236662 0.0523604 0.0314541 -0.1086393 0.0415586 -0.1108073 0.0352468 -0.105384 0.0524562 -0.0039341 0.0645235 0.1245449 -0.0391334 0.0062757 -0.0411965 0.1340485 0.1057055 -0.0287192 0.013228 -0.0495596 -0.1032939 0.0617325 0.0126701 0.0621547 0.0367732 -0.0780112 -0.0243296 -0.1024878 -0.031914 0.0908358 -0.0498879 -0.0626023 0.0315661 -0.0198616 -0.0467345 0.0616238 0.0924615 0.1093219 0.0555255 -0.0720127 0.0770202 0.0233455 -0.0336935 -0.0078586 0.0940485 0.005304 0.0971173 -0.023775 -0.0795678 0.0257449 -0.0895088 0.0606076 0.0282914 0.0030651 0.0471157 -0.0071347 0.0965541 0.03599 -0.0632947 0.1046162 -0.0762198 -0.108609 -0.0399804 -0.0109292 -0.1443911 -0.0425402 0.0161216 -0.0435742 0.0455521 0.0858742 -0.0407047 -0.0447848 -0.0793229 -0.0675186 0.0758252 -0.0724732 -0.1093013 -0.0678789 0.0417603 unknown
polarizability: 167.0021656|-13.4444663|97.4569475|4.4642736|12.1459845|99.5289517 unknown
InChI: InChI=1S/C7H11N2O3P/c1-11-13(10,12-2)9-7-5-3-4-6-8-7/h3-6,9H,1-2H3
charge 0 multiplicity 1
24 atoms
P  1.556476 -0.263152 0.423294
O  1.889184 1.329886 -0.175343
O  2.633733 -1.344382 -0.399677
O  1.601059 -0.25515 2.006908
N  0.13844 -0.817045 -0.410328
N  -2.095774 -0.969076 -1.040949
C  -1.183995 -0.366575 -0.222219
C  -1.530475 0.623801 0.738468
C  -2.883654 1.001384 0.830729
C  -3.845112 0.392348 -0.013434
C  -3.400578 -0.588736 -0.925545
C  1.88588 1.564998 -1.638577
C  3.910239 -1.691777 0.268102
H  0.242173 -1.598915 -1.064944
H  -0.775224 1.061485 1.398391
H  -3.185686 1.759311 1.561149
H  -4.9034 0.662858 0.037933
H  2.039308 2.649233 -1.743722
H  0.9188 1.272574 -2.086758
H  2.70882 1.01135 -2.124626
H  4.298471 -2.549626 -0.300203
H  3.73675 -1.971529 1.321979
H  4.618992 -0.846443 0.215186
H  -4.101928 -1.09892 -1.595315
