program: Gaussian 09
title: 000186465
version: EM64L-G09RevD.01
frameworkgroup: C1[X(C12H7Br2ClO)]
method: RPBEPBE
basis: SDD
operation: Freq
keyword: #p
keyword: freq=noraman
keyword: PBEPBE/SDD
title: #p freq=noraman PBEPBE/SDD
converged: YES YES NO NO
title: Mulliken charges:
elementType: Br Br Cl O C C C C C C C C C C C C H H H H H H H
charge: 0.097799 0.068417 0.039236 -0.283502 0.490313 0.352862 -0.305300 -0.348505 -0.121972 -0.163424 -0.360131 -0.380442 -0.220414 -0.201079 -0.191728 -0.246119 0.282664 0.259656 0.267642 0.262668 0.233052 0.234124 0.234181
chargesum: 0.00000
title: Mulliken charges with hydrogens summed into heavy atoms:
elementType: Br Br Cl O C C C C C C C C C C C C
charge: 0.097799 0.068417 0.039236 -0.283502 0.490313 0.352862 -0.305300 -0.065841 -0.121972 0.096233 -0.092489 -0.117774 -0.220414 0.031973 0.042396 -0.011937
polarizability: 2.77797334e+02 -5.28773420e+00 1.63610447e+02 -1.03376092e+01 -9.27162402e+00 9.57493921e+01
1716.lowfreq: -8.3655 -3.2769 -0.0017 -0.0008 -0.0006 1.8142 18.3781 32.7102 50.4944
frequency: 18.2862 32.6590 50.4914 61.8138 115.2204 129.4455 163.6897 179.7865 209.0100 225.1430 244.2499 296.9984 306.3565 394.5472 409.9454 432.7168 473.3951 488.0695 501.7148 556.9429 603.0985 609.1701 648.5540 691.6818 709.5808 720.3056 757.8562 771.8657 810.5861 837.8284 880.8579 910.9115 944.3232 971.1496 987.3026 991.1829 1019.3291 1030.1257 1077.2992 1127.6735 1155.9512 1163.8748 1172.1138 1186.8694 1243.0599 1307.5109 1338.5596 1355.1134 1383.2222 1418.5210 1441.9798 1471.3225 1547.2341 1570.0087 1596.4599 1607.8360 3134.2751 3143.5044 3156.9945 3163.3601 3166.8133 3177.2519 3182.0345
redmass: 7.0708 4.5908 7.1878 18.0092 6.7982 39.4357 10.1914 17.7088 7.3228 6.7383 17.4661 6.2855 9.2597 6.7598 2.9321 9.7190 8.3116 3.4293 4.5985 5.5985 7.4884 6.3297 7.1631 2.3686 7.3184 6.1040 2.4064 2.7015 1.4298 1.2476 7.8453 1.4082 1.3348 1.3628 6.2746 1.3055 2.2028 7.2220 1.5083 2.9170 1.4336 1.5260 1.1009 1.6517 3.5580 1.3714 4.4965 8.0081 8.4421 2.7944 2.2668 2.2557 7.9206 7.2507 6.3782 6.6745 1.0852 1.0890 1.0934 1.0884 1.0968 1.1003 1.0972
irintensity: 0.9668 0.1681 0.1893 0.2113 1.1494 0.3063 0.0388 0.1419 0.6928 5.2529 1.0892 0.3535 7.3118 0.3774 0.2886 6.9600 3.6057 20.4448 1.2840 7.3076 5.4016 1.1027 12.7614 24.1171 7.7920 17.4096 104.6785 24.3441 34.5948 2.0781 86.1278 4.4548 0.2823 0.2610 3.3717 0.3874 10.7289 37.4158 12.4730 41.0043 27.0833 38.2449 7.7532 40.6625 367.5120 2.8959 34.4465 14.0744 4.1147 338.1711 12.9717 120.9657 0.9459 103.2242 23.8874 27.8980 2.0108 8.7521 26.5024 1.0920 13.2292 7.2632 0.7460
temp: 298.150 k
press: 1.00000 atm
elementType: 35 35 17 8 6 6 6 6 6 6 6 6 6 6 6 6 1 1 1 1 1 1 1
symmnumber: 1
zpe: 397609.0 jmol-1
zpe.correction: 0.151441 hartree
zpe.thermalcorrener: 0.166121 hartree
zpe.thermalcorrenthalpy: 0.167065 hartree
zpe.thermalcorrgfe: 0.105599 hartree
zpe.sumelectzpe: -1022.537768 hartree
zpe.sumelectthermal: -1022.523088 hartree
zpe.sumelectthermalent: -1022.522144 hartree
zpe.sumelectthermalfe: -1022.583610 hartree
dipole: 3.2986 -2.6503 0.0845
dipole: 4.2322
quadrupole: -102.0625 -116.2962 -115.7819
quadrupole: -6.2045 -1.0568 -2.3030
quadrupole: 9.3178 -4.9160 -4.4017 -6.2045 -1.0568 -2.3030
hfenergy: -1022.6892088 hartree
pointgroup: C01 [X(C12H7Br2Cl1O1)]
dipole: -1.2940626 1.005464 0.2948733 debye
dipolederiv: -0.3648841 0.2965172 0.0173847 0.3316503 -0.1609129 -0.0045821 0.0047642 -0.0019463 0.0364529 -0.5206924 -0.2719614 -0.0535153 -0.3116318 -0.1538712 -0.0334471 -0.0817421 -0.0432398 0.000444 -0.0407554 -0.1158323 -0.0152489 -0.1257932 -0.6249237 -0.0851525 -0.0087841 -0.0784763 -0.0158779 -2.5578566 0.0157937 0.1776727 0.1142793 -0.2714697 -0.0772396 -0.1605357 -0.0718142 -0.2328502 1.830409 0.1379369 -0.0450281 0.5342368 -0.0193434 -0.0825242 0.4516327 -0.0373355 0.0828145 1.7130294 -0.1802045 -0.2325066 -0.7413643 0.1068313 0.1145893 -0.3719569 0.0589402 0.2364245 -0.4712334 0.1372036 0.0369793 0.3812382 0.8363353 0.1438147 0.0563959 0.132686 -0.0467407 -0.2967595 0.0868058 0.0373759 -0.2827797 -0.0238793 0.029372 -0.0875376 0.0178888 -0.1473269 0.5422999 -0.6427651 -0.0458116 -0.6238055 0.1921172 -0.0124656 -0.0285567 -0.0227352 -0.0588114 -0.074523 -0.2252522 -0.026815 -0.0515566 -0.0199832 -0.0016446 0.0012439 -0.0093509 -0.0743738 -0.2856939 -0.0109673 0.0514317 0.1414894 -0.1518196 -0.0090903 0.2880436 -0.0195209 -0.1266192 -0.4222562 0.0121269 0.0612104 -0.0024501 -0.1138758 0.0675834 -0.0241574 0.0766903 0.0055623 0.6302149 0.7280775 0.134154 0.5321352 0.0632898 0.0607563 0.118963 0.0852487 -0.0994722 0.0918819 -0.0381541 0.0308416 -0.0696291 -0.0879224 0.0866705 -0.0260356 0.09307 0.1185059 0.1317461 -0.0359842 0.04539 -0.0467695 -0.1094154 0.0650219 0.0763941 0.0540361 0.0601074 -0.045366 -0.0690797 -0.0605326 -0.0375612 -0.144276 0.0344046 -0.046218 0.0382103 -0.1322652 0.0209686 0.0446171 -0.0185932 0.0934744 0.0506604 -0.0192106 -0.0401412 -0.0212203 0.1491478 0.0666626 -0.0041696 -0.0011832 -0.0215438 -0.031492 -0.0168437 0.0017262 -0.0230024 0.1551678 0.0029704 0.0149695 -0.081595 0.034765 0.1292214 -0.0249587 -0.1365998 -0.0124802 0.0715211 0.1308928 0.029787 0.0238846 0.0279591 0.134572 -0.070958 0.0228606 -0.0656993 -0.0108975 0.0660805 0.014397 0.0078513 0.0270409 0.1224077 -0.0853383 0.0420001 -0.0801505 -0.0747074 -0.061622 0.0054496 -0.0959337 0.013191 0.1441778 -0.0299496 -0.1078044 -0.0259997 0.0256404 -0.0855135 0.0706889 0.052587 0.0834253 0.1335718 -0.0488078 0.0560451 -0.0437987 0.0781538 unknown
polarizability: 278.2411986|-6.1145562|156.5779313|3.5032817|22.8259924|102.3380425 unknown
InChI: InChI=1S/C12H7Br2ClO/c13-9-6-7-10(12(15)11(9)14)16-8-4-2-1-3-5-8/h1-7H
charge 0 multiplicity 1
23 atoms
Br 4.452551 -1.649749 -0.273775
Br 4.769521 1.77088 0.150672
Cl 1.354966 -2.812763 -0.640168
O  -0.778108 -0.823352 -0.658205
C  0.454993 -0.206703 -0.40868
C  -1.990434 -0.260772 -0.16156
C  1.603146 -1.041282 -0.419009
C  0.606379 1.188471 -0.243745
C  2.899129 -0.487993 -0.258088
C  1.888948 1.741595 -0.079428
C  -2.105742 0.234806 1.156749
C  -3.103282 -0.330426 -1.024373
C  3.031894 0.913786 -0.08423
C  -3.367368 0.685372 1.605078
C  -4.359095 0.11908 -0.558866
C  -4.495071 0.632655 0.752266
H  -0.273465 1.837155 -0.255048
H  2.005513 2.821261 0.044163
H  -1.236714 0.253792 1.82218
H  -2.973565 -0.735867 -2.031994
H  -3.468336 1.067032 2.626856
H  -5.229073 0.068082 -1.222268
H  -5.470086 0.980936 1.108475
