program: Gaussian 09
title: 000186466
version: EM64L-G09RevD.01
frameworkgroup: C1[X(C14H19NO3)]
method: RPBEPBE
basis: SDD
operation: Freq
keyword: #p
keyword: freq=noraman
keyword: PBEPBE/SDD
title: #p freq=noraman PBEPBE/SDD
converged: YES YES NO NO
title: Mulliken charges:
elementType: O O O N C C C C C C C C C C C C C C H H H H H H H H H H H H H H H H H H H
charge: -0.248734 -0.158545 -0.255831 -0.167152 0.153434 -0.694601 -0.688489 -0.688489 0.205483 0.461628 -0.353043 -0.366303 0.453213 0.218279 -0.351592 -0.416335 -0.808796 -0.774518 0.231136 0.227293 0.221545 0.232446 0.227778 0.211332 0.237004 0.218784 0.220721 0.299094 0.249265 0.230371 0.229608 0.221897 0.232065 0.230956 0.253853 0.246214 0.259030
chargesum: 0.00000
title: Mulliken charges with hydrogens summed into heavy atoms:
elementType: O O O N C C C C C C C C C C C C C C
charge: -0.248734 -0.158545 -0.255831 -0.167152 0.153434 -0.014626 -0.016933 -0.011980 0.205483 0.461628 -0.053949 -0.117038 0.453213 0.218279 -0.121222 -0.186727 -0.123878 -0.015422
polarizability: 2.20140071e+02 -1.32035070e+01 1.82269488e+02 1.11516656e+01 1.05048166e+01 1.17123559e+02
1716.lowfreq: -3.2271 -0.0003 -0.0002 0.0004 3.5564 7.4588 28.8010 31.4023 31.9121
frequency: 28.1644 31.3554 31.8584 44.7950 54.6822 69.1302 82.8210 125.8968 153.3430 174.5614 183.4787 189.4730 207.2417 244.1616 263.4447 270.2849 286.6130 306.3326 327.8952 339.6485 349.4358 363.1348 388.6700 406.1079 407.9615 436.0437 506.4745 529.7445 549.3509 553.0868 604.5200 638.4299 663.7817 705.1195 711.3798 748.0102 790.3622 822.3937 827.3127 839.7664 898.2611 932.1301 936.9193 949.7622 954.2576 954.9627 974.4709 983.7672 1000.3547 1008.4399 1016.4320 1023.9204 1033.7177 1039.4360 1047.2715 1134.0818 1188.7546 1207.7130 1211.2366 1225.0072 1226.5124 1251.2432 1304.8050 1329.7244 1371.6038 1373.4116 1377.8193 1381.6344 1399.1775 1406.1839 1414.8801 1449.4621 1453.0424 1465.1074 1465.8052 1470.1507 1470.4233 1474.9353 1476.4537 1477.6314 1497.7179 1497.8775 1579.3222 1600.7282 1622.7884 1687.6243 2975.3062 2983.8041 2984.8032 2991.9871 2998.7569 3053.0666 3077.6755 3081.0545 3081.7803 3090.6132 3092.2804 3094.2787 3098.5042 3101.0958 3125.1057 3128.4512 3135.0345 3181.2093 3207.1716
redmass: 2.5307 1.2753 2.6755 3.9209 6.1200 7.3690 3.7083 3.9785 4.1811 1.1446 1.3616 1.7780 1.8898 1.2251 1.2704 2.6767 4.7185 3.8773 3.3792 2.9432 2.8143 3.0282 5.0948 3.0469 4.4939 3.3224 2.7964 4.5377 4.0767 3.2973 4.6942 6.6981 5.5623 7.1303 3.2499 9.5267 5.2185 1.7256 2.2458 1.2675 5.0243 1.7281 1.6369 1.3206 1.7502 2.2220 1.3487 1.6784 2.1544 2.7799 2.0820 1.4147 1.6256 1.6816 1.5435 1.2882 1.4664 2.8722 2.1004 2.8560 3.0169 2.9910 1.6050 3.0726 5.2843 1.2208 1.2325 1.1894 1.2520 1.2031 3.2099 1.0769 1.0492 1.0491 1.0516 1.0529 1.0463 1.0497 1.1122 1.0549 1.2661 1.8743 6.2638 7.9357 6.3772 12.0810 1.0372 1.0347 1.0352 1.0358 1.0376 1.0976 1.1005 1.1003 1.0987 1.0966 1.1003 1.1009 1.1001 1.0998 1.0906 1.0905 1.1004 1.0930 1.0941
irintensity: 0.7717 0.2549 0.3586 0.1418 1.1876 0.2580 4.6301 1.0084 1.9349 0.0408 0.5810 0.1842 0.0827 0.1272 0.1346 0.1685 9.1266 6.2823 3.2181 5.2741 2.8167 3.1607 3.7854 0.5394 1.0364 3.5363 21.7672 16.0832 7.6395 1.1218 7.6008 0.8696 5.8475 4.2932 0.5353 46.4398 0.3653 14.6164 63.9432 7.7136 9.9309 3.3539 22.1807 1.1028 95.1372 142.7561 0.7187 30.9056 5.4911 6.0204 11.7035 0.1739 7.0062 40.1908 11.8349 13.0643 1.7956 5.9015 15.5075 1.9590 7.1907 2.4232 96.4901 250.3458 10.9304 6.4587 45.4460 17.2685 9.7030 17.7986 8.6077 36.1207 0.0503 3.2710 12.3837 5.2231 11.9843 17.6052 15.8326 21.3362 36.2601 132.2463 8.1323 163.8944 2.9626 128.7282 44.4009 27.0079 13.0686 22.8005 6.8676 21.1052 11.0914 26.0032 19.7129 8.5203 39.9236 9.1108 25.6689 45.1615 21.3689 17.1429 8.6151 4.7644 3.0181
temp: 298.150 k
press: 1.00000 atm
elementType: 8 8 8 7 6 6 6 6 6 6 6 6 6 6 6 6 6 6 1 1 1 1 1 1 1 1 1 1 1 1 1 1 1 1 1 1 1
symmnumber: 1
zpe: 789446.9 jmol-1
zpe.correction: 0.300684 hartree
zpe.thermalcorrener: 0.320652 hartree
zpe.thermalcorrenthalpy: 0.321596 hartree
zpe.thermalcorrgfe: 0.250674 hartree
zpe.sumelectzpe: -823.927128 hartree
zpe.sumelectthermal: -823.907160 hartree
zpe.sumelectthermalent: -823.906216 hartree
zpe.sumelectthermalfe: -823.977138 hartree
dipole: -2.7697 -3.7864 -1.5601
dipole: 4.9439
quadrupole: -88.5299 -110.4010 -113.0281
quadrupole: -4.9184 4.6529 1.2042
quadrupole: 15.4564 -6.4147 -9.0418 -4.9184 4.6529 1.2042
hfenergy: -824.2278121 hartree
pointgroup: C01 [X(C14H19N1O3)]
dipole: 1.1085752 1.4411562 -0.6910177 debye
polarizability: 219.196691|-14.6263368|181.8904074|-12.4766098|-12.646576|118.4460202 unknown
InChI: InChI=1S/C14H19NO3/c1-10-6-8-12(9-7-10)15(11(2)16)18-13(17)14(3,4)5/h6-9H,1-5H3
charge 0 multiplicity 1
37 atoms
O  1.208269 -0.333743 -0.632832
O  1.635403 -0.044102 1.670142
O  -0.622158 -3.325951 0.216763
N  0.063758 -1.154884 -0.247169
C  3.051795 1.146547 -0.018497
C  2.42198 2.306153 -0.845343
C  3.815553 1.713191 1.20355
C  4.013225 0.318345 -0.921105
C  1.930321 0.231501 0.500954
C  -1.173553 -0.432629 -0.137723
C  -2.296723 -0.994163 0.529058
C  -1.277031 0.862286 -0.705453
C  -3.612709 1.050608 0.067258
C  0.317257 -2.528053 -0.066415
C  -3.489452 -0.250908 0.61939
C  -2.481744 1.587747 -0.594007
C  -4.911493 1.829192 0.179907
C  1.761597 -2.974075 -0.235307
H  1.911487 1.924406 -1.745716
H  1.696558 2.882339 -0.242907
H  3.224063 2.995772 -1.165159
H  3.145676 2.293114 1.861581
H  4.261499 0.905149 1.808893
H  4.625503 2.377591 0.852443
H  3.487951 -0.086909 -1.802051
H  4.465485 -0.521567 -0.362751
H  4.831464 0.973388 -1.271418
H  -2.230643 -1.997325 0.950182
H  -0.426648 1.295573 -1.237165
H  -4.34648 -0.698295 1.13804
H  -2.541082 2.588531 -1.038544
H  -4.822334 2.832617 -0.27122
H  -5.740996 1.303907 -0.330496
H  -5.212726 1.960024 1.236351
H  2.387769 -2.585338 0.588391
H  2.193511 -2.625638 -1.188294
H  1.773147 -4.073201 -0.19813
