program: Gaussian 09
title: 000186439
version: EM64L-G09RevD.01
frameworkgroup: C1[X(C15H10N2O4)]
method: RPBEPBE
basis: SDD
operation: Freq
keyword: #p
keyword: freq=noraman
keyword: PBEPBE/SDD
title: #p freq=noraman PBEPBE/SDD
converged: YES YES NO NO
title: Mulliken charges:
elementType: O O O O N N C C C C C C C C C C C C C C C H H H H H H H H H H
charge: -0.170362 -0.163765 -0.168222 -0.167245 0.002523 0.011824 0.321087 0.344770 0.149021 0.094224 0.429397 -0.711495 0.438908 0.102435 -0.419355 -0.489512 -0.325222 -0.427486 -0.809815 -0.254944 -0.241437 0.239305 0.275372 0.245944 0.223312 0.249324 0.244570 0.275246 0.227695 0.235828 0.238076
chargesum: 0.00000
title: Mulliken charges with hydrogens summed into heavy atoms:
elementType: O O O O N N C C C C C C C C C C C C C C C
charge: -0.170362 -0.163765 -0.168222 -0.167245 0.002523 0.011824 0.321087 0.344770 0.149021 0.094224 0.429397 -0.472190 0.438908 0.102435 -0.143983 -0.243568 -0.101910 -0.178162 -0.062304 -0.019117 -0.003361
polarizability: 3.41157295e+02 -4.13544801e+00 2.13945000e+02 -3.57063564e+00 6.22599453e+00 9.47264381e+01
1716.lowfreq: -4.8156 -0.0006 -0.0003 0.0008 1.0820 6.4869 37.6933 49.2581 55.5387
frequency: 37.6430 49.2579 55.5351 88.4878 101.8480 140.3880 155.3672 163.7301 169.3076 176.1758 234.9000 254.0229 270.4222 286.1025 301.2325 352.9754 376.5228 414.5389 438.9637 455.0976 487.8052 507.4702 525.1206 528.7914 555.8175 603.5392 624.4743 636.1553 673.5020 691.0969 701.7477 733.1692 742.5011 760.6904 764.6569 799.9566 822.6134 836.4184 863.8128 887.8732 893.7747 903.3676 954.0241 961.2544 986.3534 999.2368 1030.4602 1040.5652 1051.0720 1085.6483 1127.3671 1171.4933 1183.6811 1212.0635 1218.7529 1237.3928 1239.8246 1263.9503 1269.7868 1303.9567 1361.9927 1377.8326 1386.7402 1390.9127 1408.5154 1411.8906 1425.3093 1435.8166 1450.0126 1460.3940 1473.4916 1501.2925 1514.9549 1566.4566 1606.3741 1618.0563 1627.3519 2995.8003 3079.1000 3103.2222 3130.2071 3137.6182 3140.5527 3154.5337 3165.6142 3172.2581 3183.7202
redmass: 11.9592 6.8843 6.2780 4.1919 7.1224 1.3318 5.1545 6.7000 7.9829 3.2709 5.6284 4.5862 5.3259 5.1956 7.6678 6.0543 5.6040 3.1743 5.1740 5.7264 6.1135 4.3719 4.5493 5.9801 3.0352 6.9089 6.0384 6.9823 7.2510 4.6221 11.0261 8.3672 3.4553 6.0866 1.4988 2.3257 7.8197 1.7092 5.0072 1.6310 5.8380 1.7285 6.2905 1.3681 1.3739 1.3703 1.5199 2.3344 1.5327 3.6758 2.7529 1.4359 1.1101 9.2023 7.5331 2.0536 2.1494 1.7351 2.5646 2.3388 6.0399 6.2360 5.6674 6.1288 1.4523 2.5157 2.6100 3.6472 3.2387 1.1115 1.2284 3.3888 2.9841 6.9496 6.2543 6.8454 6.7129 1.0376 1.0967 1.1005 1.0869 1.0900 1.0886 1.0944 1.0926 1.0973 1.0951
irintensity: 0.2441 1.1557 0.2978 0.6273 1.4462 0.8796 1.6138 1.1333 1.3033 2.2230 2.1297 0.2641 0.6306 4.1375 1.3936 1.1558 3.9256 3.4134 1.4311 0.9979 5.0696 6.3047 8.5737 1.7841 3.6993 1.0258 1.6192 3.9571 12.0342 1.9238 16.6305 37.3993 4.1023 2.9958 52.3526 0.6051 4.2570 54.3837 4.6791 4.5062 2.8134 13.9908 6.9690 1.7343 2.0624 0.8811 1.3494 4.3435 7.1892 0.2656 2.5746 1.0276 1.5952 107.1962 221.6644 2.1283 43.1420 27.2402 34.5990 6.6264 105.2515 15.6833 58.8750 129.0405 21.2659 15.8389 5.3019 21.6125 6.7224 11.9685 24.1919 17.8920 6.7390 1.5491 34.6902 3.1426 0.2888 11.9823 7.5708 9.5754 1.5585 5.2084 7.1296 16.7231 12.0166 28.7115 4.6441
temp: 298.150 k
press: 1.00000 atm
elementType: 8 8 8 8 7 7 6 6 6 6 6 6 6 6 6 6 6 6 6 6 6 1 1 1 1 1 1 1 1 1 1
symmnumber: 1
zpe: 578297.4 jmol-1
zpe.correction: 0.220262 hartree
zpe.thermalcorrener: 0.237257 hartree
zpe.thermalcorrenthalpy: 0.238201 hartree
zpe.thermalcorrgfe: 0.175006 hartree
zpe.sumelectzpe: -986.391595 hartree
zpe.sumelectthermal: -986.374601 hartree
zpe.sumelectthermalent: -986.373656 hartree
zpe.sumelectthermalfe: -986.436851 hartree
dipole: 8.1618 3.6394 -0.0505
dipole: 8.9366
quadrupole: -126.6892 -109.4832 -127.7051
quadrupole: -8.3413 1.7799 -3.5941
quadrupole: -5.3967 11.8093 -6.4126 -8.3413 1.7799 -3.5941
hfenergy: -986.6118573 hartree
pointgroup: C01 [X(C15H10N2O4)]
dipole: -3.2245753 -1.4008739 0.038236 debye
polarizability: 341.0076558|-5.0200021|212.9378857|5.449378|-13.0181892|95.8831911 unknown
InChI: InChI=1S/C15H10N2O4/c1-9-8-13-11-5-3-2-4-10(11)6-7-12(13)15(17(20)21)14(9)16(18)19/h2-8H,1H3
charge 0 multiplicity 1
31 atoms
O  2.040624 2.746402 -0.916411
O  3.093587 1.963222 0.953138
O  4.127952 -1.40796 0.869735
O  4.132327 -0.053315 -0.96977
N  2.242636 1.855951 -0.008739
N  3.537508 -0.689573 -0.020061
C  -0.781809 -0.485765 -0.013247
C  -0.012861 0.739491 -0.054355
C  -2.246233 -0.415739 -0.010224
C  1.411098 0.622361 -0.042648
C  -2.883614 0.876887 -0.033403
C  -0.088178 -1.729279 0.032347
C  1.312655 -1.840947 0.055344
C  2.053542 -0.623719 0.024273
C  -0.693875 2.015908 -0.074779
C  -2.072397 2.071478 -0.059824
C  -3.080609 -1.575652 0.016533
C  -4.308754 0.968386 -0.027758
C  1.97933 -3.201222 0.087124
C  -4.477869 -1.465746 0.020892
C  -5.100825 -0.185182 -0.000838
H  -0.658366 -2.661657 0.047217
H  -0.111232 2.938116 -0.120079
H  -2.578792 3.043197 -0.07656
H  -2.638358 -2.5760 0.032643
H  -4.774329 1.96041 -0.045707
H  2.740479 -3.30846 -0.70681
H  2.500887 -3.363999 1.045739
H  1.229967 -3.997599 -0.048597
H  -5.094461 -2.370569 0.04041
H  -6.19303 -0.107625 0.002914
