program: Gaussian 09
title: 000186444
version: EM64L-G09RevD.01
frameworkgroup: C1[X(C16H22O5)]
method: RPBEPBE
basis: SDD
operation: Freq
keyword: #pfreq=noraman
keyword: PBEPBE/SDD
title: #p freq=noraman PBEPBE/SDD
converged: YES YES NO NO
title: Mulliken charges:
elementType: O O O O O C C C C C C C C C C C C C C C C H H H H H H H H H H H H H H H H H H H H H H
charge: -0.448799 -0.260233 -0.241107 -0.430229 -0.235974 -0.036473 -0.428618 -0.084103 -0.360523 -0.377331 -0.356309 -0.720007 -0.700832 0.152788 0.200517 0.168968 -0.366060 -0.320486 -0.217765 -0.218836 0.101075 0.212733 0.190959 0.239588 0.204842 0.180675 0.197222 0.251683 0.243437 0.192532 0.207435 0.233924 0.236713 0.217225 0.330201 0.215779 0.206925 0.209861 0.271789 0.273083 0.241086 0.240022 0.382623
chargesum: 0.00000
title: Mulliken charges with hydrogens summed into heavy atoms:
elementType: O O O O O C C C C C C C C C C C C C C C C
charge: -0.118598 -0.260233 -0.241107 -0.047606 -0.235974 0.176259 0.001929 0.120740 0.017373 0.117789 0.043658 -0.032145 -0.068267 0.152788 0.200517 0.168968 -0.094271 -0.047403 0.023321 0.021186 0.101075
polarizability: 2.44660991e+02 1.60330400e+00 1.63354818e+02 -5.25457386e+00 2.29123011e+01 1.67071594e+02
1716.lowfreq: -17.6701 -6.2773 -0.0008 -0.0007 -0.0006 1.0540 9.8976 18.7044 28.5077
frequency: -14.2393 17.5656 28.3566 36.9377 43.1206 57.6999 73.1851 83.1509 106.7335 112.8042 122.8113 140.1387 147.0962 175.8582 210.7800 225.6451 232.4879 243.2500 257.8058 269.6407 303.3041 334.1321 342.9888 355.5732 371.5540 396.4385 407.3967 418.0715 481.3080 504.2813 516.9896 539.2823 592.2278 595.0131 603.9093 649.5910 675.3141 705.7629 719.3627 736.7718 757.4026 779.2144 790.7584 798.3512 822.1382 873.5655 889.1761 895.5734 900.8325 909.0125 935.8873 978.3947 998.4168 1000.2435 1006.1633 1022.7588 1033.0527 1037.2374 1065.9524 1072.1198 1082.2617 1092.7623 1108.4619 1113.1426 1141.2032 1151.9829 1161.9975 1178.8047 1209.2340 1233.1701 1239.4060 1243.0626 1268.4860 1272.0577 1278.0395 1292.5577 1293.9458 1312.1236 1315.3532 1338.3893 1348.4329 1359.4799 1368.9221 1379.5254 1382.0304 1386.7295 1401.7329 1428.6002 1456.6259 1461.0376 1463.3881 1465.4646 1474.6797 1477.2824 1478.0237 1483.7066 1485.7649 1578.1243 1602.1913 1616.6920 1644.4245 2948.6926 2954.0449 2966.8032 2969.4873 2970.1376 2978.6698 2997.9128 3000.3984 3024.9304 3026.2809 3057.6554 3067.3852 3069.3443 3096.9621 3099.7045 3103.5829 3140.2045 3155.6283 3169.3978 3181.5795 3524.6833 3548.8256
redmass: 2.1038 5.2866 3.4911 3.9512 6.7226 3.3654 4.2460 4.0216 4.6212 3.0692 3.6226 5.5092 4.7435 4.4999 1.0970 1.4404 2.8117 4.2743 2.3331 3.8387 3.2878 2.9428 1.4783 4.3740 4.9348 4.2001 3.2891 3.0216 3.0962 2.8045 4.2120 4.9617 2.9205 1.5467 3.4671 5.3412 4.9707 3.6770 1.1559 5.3018 1.4278 2.9947 1.8598 4.7038 1.8569 2.3704 2.3524 2.1875 1.7668 1.8182 1.5644 1.4238 2.2507 3.9260 1.3777 1.7812 3.1133 2.6436 2.2818 2.7897 2.3602 1.6690 1.8574 1.8688 2.0495 2.4283 1.7660 1.0636 1.4718 1.3578 2.6774 1.2605 1.2305 1.2818 1.5499 1.1285 1.2224 2.5270 1.1856 1.3355 1.4413 1.4205 1.4356 1.2705 10.4132 1.2212 1.5304 2.1912 1.0720 1.0697 1.1079 1.0661 1.0774 1.0561 2.4483 1.0550 1.0759 7.2107 6.3260 9.7514 8.9084 1.0804 1.0606 1.0689 1.0679 1.0402 1.0701 1.0362 1.0945 1.0567 1.1011 1.0980 1.1007 1.0992 1.0997 1.1001 1.1080 1.0865 1.0912 1.0963 1.0981 1.0641 1.0658
irintensity: 0.0634 0.2339 0.2365 0.6112 0.9395 1.0607 2.0141 1.1069 0.5733 0.7341 0.5908 1.4415 0.7343 1.1530 4.2609 0.0932 0.8963 1.5246 0.3147 6.9541 15.9770 84.9542 99.1301 7.3893 1.5828 9.5008 6.1969 8.2832 1.8899 4.9384 1.0348 19.2404 46.8102 54.6049 20.9602 7.9743 4.9313 94.3518 20.3537 4.6825 0.4935 20.8917 36.1455 0.4285 4.1098 14.8776 14.7156 28.7080 7.3566 4.7949 15.2323 14.7301 40.2741 165.1630 5.1644 16.2974 76.1211 25.1825 78.5822 103.0874 7.6795 12.4224 36.8239 27.0630 14.8630 10.3156 68.5865 0.1120 18.6136 49.1452 152.1688 53.1481 14.2102 0.8290 38.0467 6.7782 16.2024 66.0827 2.8608 3.4757 1.1778 3.6395 5.1323 9.4358 13.6889 12.0422 27.4808 8.7397 6.5424 9.1486 17.4643 3.4916 2.3549 9.2390 16.7236 3.0150 19.8746 34.0234 32.9370 128.4231 301.3643 13.2189 13.1255 13.4319 79.9319 23.5315 58.1236 13.5193 9.0156 22.6827 23.4505 18.6561 114.0330 53.6220 39.8105 28.2238 6.1346 2.5218 8.8026 9.3312 11.4825 34.6106 6.4727
temp: 298.150 k
press: 1.00000 atm
elementType: 8 8 8 8 8 6 6 6 6 6 6 6 6 6 6 6 6 6 6 6 6 1 1 1 1 1 1 1 1 1 1 1 1 1 1 1 1 1 1 1 1 1 1
symmnumber: 1
zpe: 924248.0 jmol-1
zpe.correction: 0.352027 hartree
zpe.thermalcorrener: 0.373955 hartree
zpe.thermalcorrenthalpy: 0.374899 hartree
zpe.thermalcorrgfe: 0.298933 hartree
zpe.sumelectzpe: -997.421802 hartree
zpe.sumelectthermal: -997.399875 hartree
zpe.sumelectthermalent: -997.398931 hartree
zpe.sumelectthermalfe: -997.474897 hartree
dipole: 2.3059 1.7722 1.9515
dipole: 3.5023
quadrupole: -105.7927 -129.3059 -125.3378
quadrupole: -2.8802 -0.2368 9.2764
quadrupole: 14.3528 -9.1604 -5.1924 -2.8802 -0.2368 9.2764
hfenergy: -997.7738298 hartree
pointgroup: C01 [X(C16H22O5)]
dipole: -0.8139792 0.709508 -0.85595 debye
polarizability: 244.8691414|0.6443145|163.8611285|3.3721366|-22.9933623|166.3571324 unknown
InChI: InChI=1S/C16H22O5/c1-3-4-7-12(11(2)17)10-21-16(20)14-9-6-5-8-13(14)15(18)19/h5-6,8-9,11-12,17-18H,3-4,7,10H2,1-2H3
charge 0 multiplicity 1
43 atoms
O  3.660036 -2.263737 -1.947095
O  -0.051309 -1.182657 -0.526316
O  -0.663438 -1.064482 1.7293
O  -1.388825 1.79053 -2.943944
O  -0.098265 1.649219 -1.023644
C  2.385938 -0.71437 -0.45846
C  2.46641 0.365024 0.653236
C  3.746405 -1.424284 -0.72608
C  3.265731 1.62758 0.257907
C  1.287732 -1.759427 -0.184008
C  3.246664 2.70971 1.362008
C  4.220013 -2.377867 0.378116
C  4.035753 3.978965 0.97568
C  -0.900239 -0.841689 0.517066
C  -2.205669 -0.295338 0.00679
C  -2.337215 0.636459 -1.065207
C  -3.371703 -0.80808 0.62503
C  -3.631635 0.985612 -1.530151
C  -4.655085 -0.441936 0.166584
C  -4.785264 0.445289 -0.925547
C  -1.160075 1.365018 -1.623804
H  2.10115 -0.195351 -1.400639
H  2.891023 -0.078269 1.577518
H  1.43762 0.681786 0.90187
H  4.514187 -0.637345 -0.882723
H  4.320675 1.371943 0.025666
H  2.825342 2.05005 -0.668747
H  1.393665 -2.624218 -0.859569
H  1.267928 -2.082863 0.871391
H  3.662305 2.284773 2.298755
H  2.19365 2.977356 1.581832
H  5.203304 -2.798965 0.10864
H  3.515775 -3.218973 0.49996
H  4.316768 -1.852189 1.343854
H  3.389507 -1.687286 -2.707158
H  4.000183 4.738012 1.778849
H  5.099382 3.742921 0.780909
H  3.620777 4.437956 0.058315
H  -3.253939 -1.503405 1.461912
H  -3.717343 1.696064 -2.356597
H  -5.54537 -0.852802 0.654088
H  -5.777084 0.72644 -1.29439
H  -0.602966 2.320021 -3.247398
