program: Gaussian 09
title: 000186449
version: EM64L-G09RevD.01
frameworkgroup: C1[X(C16H20O5)]
method: RPBEPBE
basis: SDD
operation: Freq
keyword: #pfreq=noraman
keyword: PBEPBE/SDD
title: #p freq=noraman PBEPBE/SDD
converged: YES YES NO NO
title: Mulliken charges:
elementType: O O O O O C C C C C C C C C C C C C C C C H H H H H H H H H H H H H H H H H H H H
charge: -0.245558 -0.216953 -0.220555 -0.429280 -0.252373 -0.118960 -0.449421 -0.352779 -0.371901 -0.355834 0.218414 -0.698020 -0.798086 0.153762 0.228696 0.141029 -0.368541 -0.318806 -0.215953 -0.217577 0.113045 0.263866 0.196225 0.232094 0.183972 0.210561 0.224727 0.263360 0.191642 0.202175 0.216839 0.213819 0.207914 0.230313 0.277294 0.247333 0.268061 0.276016 0.242087 0.240993 0.386363
chargesum: 0.00000
title: Mulliken charges with hydrogens summed into heavy atoms:
elementType: O O O O O C C C C C C C C C C C C C C C C
charge: -0.245558 -0.216953 -0.220555 -0.042917 -0.252373 0.144906 -0.021102 0.041754 0.116185 0.037984 0.218414 -0.059449 -0.043146 0.153762 0.228696 0.141029 -0.100481 -0.042790 0.026134 0.023416 0.113045
polarizability: 2.55378441e+02 -3.48639766e+00 1.86342457e+02 -5.11435114e+00 3.13758423e+00 1.29178362e+02
1716.lowfreq: -12.9450 -4.2578 -0.0007 -0.0003 0.0003 3.9262 18.0466 20.2825 33.4873
frequency: 17.2643 20.2219 33.4382 49.4641 54.9009 69.8117 74.7090 90.6524 95.6528 106.0332 124.8916 132.8629 142.8650 155.2490 180.0302 210.6465 224.2288 227.6786 249.9229 263.3519 302.6844 334.5786 352.9064 379.0174 393.6229 407.1990 438.7995 472.7066 519.3246 550.1278 585.4620 591.9618 598.3422 612.8168 649.9828 679.3316 706.4824 715.1734 731.2908 744.6727 774.9769 791.5738 792.3932 812.6386 880.8583 896.1454 907.4525 920.2589 950.0628 977.3156 979.7326 1000.4263 1005.0794 1006.9917 1026.9131 1030.7646 1037.1388 1065.5744 1077.1722 1089.6540 1110.5368 1115.2395 1118.9331 1162.8710 1176.2860 1179.7885 1210.0296 1229.2129 1238.7810 1253.3305 1274.4949 1281.1925 1291.3384 1294.8082 1320.3468 1326.8712 1348.4683 1350.5598 1362.9691 1372.1207 1382.3833 1388.8480 1429.2099 1440.7396 1448.1086 1451.9921 1459.5906 1466.5212 1475.6521 1475.9949 1478.6058 1486.6604 1578.3927 1602.9025 1620.9150 1632.7949 1637.9209 2956.2135 2965.2736 2971.1909 2972.7883 2977.8679 2999.2317 3018.1757 3023.1485 3030.4511 3046.3378 3065.8312 3069.3937 3072.2671 3105.5168 3125.8417 3141.0149 3155.5527 3169.2621 3182.7009 3528.3616
redmass: 4.8957 4.8339 6.1177 3.2055 3.0366 2.4411 4.9690 3.7841 4.8462 5.5494 2.7299 1.2243 4.1870 4.0479 4.7786 1.9507 1.8942 2.8165 3.7887 4.5558 3.1490 6.9022 4.9758 4.5448 3.6492 3.2729 3.2968 3.9391 5.1254 4.3833 3.2631 1.4313 3.2247 2.7006 5.3680 4.9170 3.7860 1.9802 1.8229 1.8413 3.0902 2.1186 2.7044 1.6530 2.7268 2.0117 1.8609 1.3818 1.9277 1.4375 2.4384 1.6117 2.6040 1.8315 2.6508 3.2775 2.9543 3.0694 2.5161 2.3189 1.8430 1.8415 2.4550 1.7555 2.2255 1.0679 1.4581 1.2509 2.8811 1.2206 1.2787 1.5530 1.0713 1.1974 2.6472 1.3605 1.5249 1.4541 1.3120 1.3013 10.9296 1.2152 2.1821 1.0704 1.0573 1.0927 1.1014 1.0707 1.0484 1.0666 2.5911 1.0823 7.1790 6.2664 10.3857 7.6184 8.2790 1.0589 1.0596 1.0594 1.0375 1.0393 1.0963 1.0951 1.0663 1.0874 1.0998 1.0919 1.1006 1.0994 1.1076 1.1015 1.0865 1.0913 1.0967 1.0979 1.0642
irintensity: 0.3299 0.3874 0.6042 0.0953 0.3370 0.6168 7.6812 3.7105 0.2484 1.5028 0.5528 0.6336 1.3426 0.6871 2.5333 0.2788 2.5144 0.7331 5.7919 1.5946 6.8675 3.2696 5.3634 8.5273 7.7112 7.0542 6.4027 1.8211 13.5674 9.2778 6.3338 76.9344 45.1291 3.5608 9.1342 11.9752 93.8230 5.5416 2.9719 6.2277 26.6094 15.8828 15.9703 0.8576 23.4609 4.9027 4.6399 0.9783 1.4146 6.7203 5.4428 3.1434 141.8858 73.9226 43.1278 38.0386 28.5298 142.6820 13.9932 29.3725 56.5505 1.5132 7.1550 70.5602 41.6597 0.0856 0.6803 27.4375 196.1218 10.4792 6.6999 39.7202 1.4226 12.1652 80.5524 8.4909 10.6487 1.8602 3.5491 70.5204 10.9087 9.8313 6.6075 19.7128 10.1432 4.4491 20.9896 0.9439 12.7107 3.9347 19.0771 16.0386 28.0580 22.7015 127.8183 289.9259 128.1715 4.4884 1.5492 99.7951 31.3707 6.9290 2.9643 2.4414 19.3253 16.7955 39.1030 6.7546 83.0452 55.0022 10.1616 12.4373 2.0165 8.3486 10.4363 10.1573 43.6399
temp: 298.150 k
press: 1.00000 atm
elementType: 8 8 8 8 8 6 6 6 6 6 6 6 6 6 6 6 6 6 6 6 6 1 1 1 1 1 1 1 1 1 1 1 1 1 1 1 1 1 1 1 1
symmnumber: 1
zpe: 863496.3 jmol-1
zpe.correction: 0.328888 hartree
zpe.thermalcorrener: 0.351303 hartree
zpe.thermalcorrenthalpy: 0.352247 hartree
zpe.thermalcorrgfe: 0.274233 hartree
zpe.sumelectzpe: -996.252823 hartree
zpe.sumelectthermal: -996.230409 hartree
zpe.sumelectthermalent: -996.229465 hartree
zpe.sumelectthermalfe: -996.307478 hartree
dipole: 3.0461 4.5192 -1.3918
dipole: 5.6249
quadrupole: -102.1278 -126.4939 -125.0541
quadrupole: -8.1879 1.8599 7.6786
quadrupole: 15.7641 -8.6019 -7.1622 -8.1879 1.8599 7.6786
hfenergy: -996.5817114 hartree
pointgroup: C01 [X(C16H20O5)]
dipole: -1.1084502 -0.9275022 1.6758538 debye
polarizability: 252.803359|18.2980454|132.0228401|4.9738595|-4.6450279|186.073061 unknown
InChI: InChI=1S/C16H20O5/c1-3-4-7-12(11(2)17)10-21-16(20)14-9-6-5-8-13(14)15(18)19/h5-6,8-9,12,18H,3-4,7,10H2,1-2H3
charge 0 multiplicity 1
41 atoms
O  -0.121257 -1.34225 -0.579545
O  2.627442 1.150862 -2.238328
O  -0.710269 0.449515 -1.957211
O  -1.849921 -0.752444 3.196075
O  -0.533861 0.41627 1.688782
C  2.155409 -0.27782 -0.329867
C  3.616456 -0.810441 -0.224063
C  4.554989 0.102295 0.596613
C  1.285171 -1.307132 -1.091487
C  5.970309 -0.497116 0.760834
C  2.163786 1.082899 -1.068385
C  6.91682 0.412953 1.572745
C  1.654278 2.294741 -0.314214
C  -0.999346 -0.381548 -1.065329
C  -2.371173 -0.551512 -0.471517
C  -2.630432 -0.601789 0.929305
C  -3.444196 -0.698073 -1.381476
C  -3.948084 -0.856465 1.389122
C  -4.754962 -0.938684 -0.915027
C  -5.005017 -1.033165 0.473081
C  -1.564163 -0.264237 1.913252
H  1.733861 -0.15221 0.684488
H  3.590332 -1.816385 0.243396
H  4.021687 -0.930319 -1.248412
H  4.115062 0.282754 1.600192
H  4.640554 1.091936 0.103743
H  1.63273 -2.335194 -0.901299
H  1.278387 -1.092947 -2.175503
H  5.892911 -1.487644 1.254619
H  6.403551 -0.681984 -0.242925
H  7.921044 -0.037439 1.676386
H  7.037125 1.396943 1.081716
H  6.519965 0.592238 2.590062
H  2.303276 2.483592 0.564345
H  0.641903 2.097695 0.081189
H  1.646575 3.182295 -0.965245
H  -3.23902 -0.63104 -2.454467
H  -4.129789 -0.893954 2.466436
H  -5.574098 -1.055603 -1.632267
H  -6.018445 -1.226614 0.83931
H  -1.131294 -0.45908 3.818378
