program: Gaussian 09
title: 000186437
version: EM64L-G09RevD.01
frameworkgroup: C1[X(C20H9FO2)]
method: RPBEPBE
basis: SDD
operation: Freq
keyword: #p
keyword: freq=noraman
keyword: PBEPBE/SDD
title: #p freq=noraman PBEPBE/SDD
converged: YES YES YES YES
title: Mulliken charges:
elementType: F O O C C C C C C C C C C C C C C C C C C C C H H H H H H H H H
charge: -0.191656 -0.174069 -0.210080 0.140455 0.088998 0.386650 0.270599 0.297261 0.496815 0.246033 0.235485 -0.403928 -0.464252 -0.445218 -0.526948 -0.431778 -0.391171 -0.038010 -0.320893 -0.565094 -0.347612 -0.401095 0.348945 0.233652 0.299697 0.249027 0.294476 0.245998 0.232495 0.321451 0.260155 0.263611
chargesum: 0.00000
title: Mulliken charges with hydrogens summed into heavy atoms:
elementType: F O O C C C C C C C C C C C C C C C C C C C C
charge: -0.191656 -0.174069 -0.210080 0.140455 0.088998 0.386650 0.270599 0.297261 0.496815 0.246033 0.235485 -0.403928 -0.230600 -0.145520 -0.277921 -0.137302 -0.145172 -0.038010 -0.088398 -0.243644 -0.087457 -0.137484 0.348945
polarizability: 4.47836311e+02 -2.32425822e+00 2.58376465e+02 -1.56512939e-02 -2.74815925e-02 8.02612410e+01
1716.lowfreq: -0.0009 -0.0007 -0.0005 5.9975 6.5968 14.8784 39.4906 68.2348 94.9431
frequency: 39.4902 68.2337 94.9407 113.2520 156.5963 160.7311 200.4501 243.6474 258.8986 260.9119 272.8510 336.5567 354.1388 380.1136 405.1980 410.1231 427.9238 436.5605 465.9457 468.1672 489.8067 495.8542 516.6796 558.1490 580.7337 591.6365 617.7559 651.0170 652.5935 667.4857 681.3505 723.0986 736.1059 758.7900 801.8602 804.3374 807.7097 823.6533 842.2269 871.2020 900.4757 908.8046 917.7890 955.0503 961.4302 966.9402 978.1507 993.8327 1000.3495 1026.0779 1077.4046 1090.0775 1122.5464 1134.6530 1154.4806 1176.2452 1193.3375 1205.4061 1240.8039 1256.6362 1276.9695 1283.5273 1306.7054 1345.5115 1379.6646 1390.1453 1403.6380 1406.5189 1427.4728 1437.7707 1462.3292 1488.2000 1514.0697 1523.8146 1537.0448 1565.3759 1577.2616 1590.4203 1597.3583 1617.4734 1627.0387 3123.7125 3134.7105 3151.0491 3157.3420 3166.8340 3168.0560 3168.6195 3173.1622 3181.4524
redmass: 10.2888 5.7424 9.1973 5.0897 6.2484 8.9958 4.5498 5.8371 11.7250 5.8497 10.7451 5.0165 9.2456 7.0450 7.1294 3.5258 9.2119 4.6914 6.6278 3.4067 8.7350 3.8082 5.7017 4.2364 6.2537 6.5354 3.5304 6.6854 3.9968 7.4406 7.0052 3.4993 3.3404 7.1500 5.4126 7.4343 2.8466 1.4444 1.9201 1.7738 1.9719 5.6228 1.4773 1.5847 1.9328 5.4382 1.6047 3.7774 1.4038 1.4371 2.9625 2.1112 1.8256 1.6734 1.6456 1.8083 1.6868 2.0721 2.0188 1.7209 2.6709 2.5668 2.3053 2.9992 5.5227 2.8576 4.2801 8.4274 7.1038 4.6194 2.8766 3.9098 6.8749 5.6599 8.8457 6.2103 6.7543 7.5948 7.4967 7.3168 7.4657 1.0893 1.0893 1.0887 1.0899 1.0965 1.0941 1.0940 1.0929 1.0965
irintensity: 0.0823 0.2803 5.6023 0.9379 0.2101 1.0348 9.3088 0.0011 0.9325 0.0036 0.3920 0.6035 17.9568 2.2189 3.7393 0.5360 14.5870 0.1988 2.8203 0.8400 1.3411 7.9360 4.3970 4.9851 1.1889 1.7594 0.0016 18.4778 2.5354 15.8536 1.8497 2.6768 2.1864 12.2822 38.7941 0.9528 11.0593 17.2573 37.9205 101.5376 0.2154 26.4660 0.8089 17.3558 12.5901 5.1490 0.8235 3.4579 0.4469 0.2847 7.8349 8.8854 5.7694 3.5558 15.3275 46.2234 3.4625 23.2500 17.1879 10.3002 100.8275 88.4604 20.3596 84.0318 30.9040 5.0092 35.6464 7.9808 11.2907 9.9154 80.5573 39.4516 229.6853 19.8069 220.8054 34.6605 29.7047 12.6616 25.3502 43.6156 26.7890 12.3480 16.2144 0.6683 2.0812 1.9436 8.7964 14.1206 5.8846 11.2532
temp: 298.150 k
press: 1.00000 atm
elementType: 9 8 8 6 6 6 6 6 6 6 6 6 6 6 6 6 6 6 6 6 6 6 6 1 1 1 1 1 1 1 1 1
symmnumber: 1
zpe: 596162.1 jmol-1
zpe.correction: 0.227066 hartree
zpe.thermalcorrener: 0.242786 hartree
zpe.thermalcorrenthalpy: 0.243730 hartree
zpe.thermalcorrgfe: 0.184228 hartree
zpe.sumelectzpe: -1016.360663 hartree
zpe.sumelectthermal: -1016.344943 hartree
zpe.sumelectthermalent: -1016.343999 hartree
zpe.sumelectthermalfe: -1016.403501 hartree
dipole: 0.6320 -6.5470 0.0020
dipole: 6.5774
quadrupole: -152.1243 -119.2982 -133.1667
quadrupole: 2.8341 -0.0052 0.0025
quadrupole: -17.2612 15.5648 1.6964 2.8341 -0.0052 0.0025
hfenergy: -1016.587729 hartree
pointgroup: C01 [X(C20H9F1O2)]
dipole: 0.242863 -2.5763276 0.0007992 debye
polarizability: 447.8248964|-2.750399|258.3878801|-0.0157131|-0.0274463|80.261241 unknown
InChI: InChI=1S/C20H9FO2/c21-11-3-5-12-13-4-1-10-2-8-17(22)14-6-7-15(19(13)18(10)14)20(23)16(12)9-11/h1-9H
charge 0 multiplicity 1
32 atoms
F  6.083034 0.190263 -0.000328
O  1.819685 2.945634 -0.000641
O  -5.145444 1.454223 -0.000566
C  -0.443969 0.009742 0.000125
C  -1.856684 -0.27677 0.00033
C  0.516246 -1.072212 0.000205
C  -0.021847 1.381667 -0.000183
C  1.961237 -0.762833 0.00004
C  -2.31644 -1.642066 0.000469
C  -2.807154 0.797792 0.000321
C  2.400738 0.600986 -0.000234
C  1.427366 1.732747 -0.000449
C  0.026043 -2.39638 0.000433
C  -0.975755 2.421628 -0.000255
C  -1.361342 -2.678012 0.000518
C  -2.357696 2.134061 -0.000003
C  -3.747035 -1.915837 0.000316
C  -4.281865 0.511613 0.000939
C  2.957997 -1.781824 0.000127
C  3.78066 0.923554 -0.00036
C  -4.681637 -0.906228 0.000281
C  4.328647 -1.472737 0.000005
C  4.711729 -0.115749 -0.000224
H  0.720177 -3.240993 0.000489
H  -0.608078 3.452496 -0.000474
H  -1.699299 -3.720624 0.000586
H  -3.108722 2.930606 0.000059
H  -4.06729 -2.965098 0.000097
H  2.671655 -2.836672 0.000289
H  4.084306 1.974278 -0.000579
H  -5.757096 -1.110262 -0.000013
H  5.092332 -2.255593 0.00008
