program: Gaussian 09
title: 000186441
version: EM64L-G09RevD.01
frameworkgroup: C1[X(C15H20O5)]
method: RPBEPBE
basis: SDD
operation: Freq
keyword: #pfreq=noraman
keyword: PBEPBE/SDD
title: #p freq=noraman PBEPBE/SDD
converged: YES YES NO NO
title: Mulliken charges:
elementType: O O O O O C C C C C C C C C C C C C C C H H H H H H H H H H H H H H H H H H H H
charge: -0.271422 -0.446776 -0.234951 -0.427528 -0.235271 0.006178 -0.404796 -0.373965 -0.384269 -0.421531 -0.723739 -0.352662 0.170637 0.206451 0.146384 -0.341032 -0.327933 -0.216786 -0.217577 0.105719 0.184365 0.228337 0.186323 0.197732 0.221010 0.253632 0.225121 0.231063 0.202572 0.210181 0.220089 0.220289 0.223113 0.202092 0.330931 0.264816 0.274943 0.240034 0.240729 0.387495
chargesum: 0.00000
title: Mulliken charges with hydrogens summed into heavy atoms:
elementType: O O O O O C C C C C C C C C C C C C C C
charge: -0.271422 -0.115845 -0.234951 -0.040034 -0.235271 0.190544 0.009864 0.044777 0.094484 0.012104 -0.073180 0.072544 0.170637 0.206451 0.146384 -0.076216 -0.052990 0.023249 0.023152 0.105719
polarizability: 2.16509907e+02 -5.07330927e+00 2.02011468e+02 -9.94601359e+00 -4.34707251e+00 1.19524793e+02
1716.lowfreq: -8.1592 -0.0005 -0.0002 0.0005 4.1985 5.1149 12.7713 28.2947 38.2117
frequency: 10.9360 28.1870 38.1593 45.3510 56.6837 65.2329 91.3795 100.6594 113.5915 117.1015 134.0195 153.3135 174.9636 196.3447 213.2847 231.9497 260.6707 286.2024 294.7514 302.9584 332.2157 348.8505 379.0997 400.6914 402.0660 466.9467 484.6306 519.3705 525.5584 592.9794 595.5935 600.7348 646.3487 677.8147 704.1951 736.6568 752.3955 773.0876 774.5840 789.0949 790.5019 809.1163 862.9910 883.5567 902.2299 911.9475 956.9689 975.3724 985.5400 1003.3402 1005.4914 1017.4018 1027.3218 1036.6183 1050.3075 1050.9946 1070.3565 1091.4871 1119.4755 1125.7441 1145.9313 1150.4643 1161.5335 1179.1516 1228.7433 1235.9443 1247.5121 1255.0776 1269.8493 1275.4924 1282.1244 1303.4521 1317.9911 1337.1802 1340.8564 1347.2977 1361.7417 1366.2941 1382.1420 1384.0989 1390.9892 1426.9669 1462.3651 1465.6786 1469.9094 1477.0605 1478.8541 1481.0807 1489.6772 1492.2278 1583.8008 1598.9577 1622.7224 1645.1634 2941.6519 2968.2266 2973.3405 2974.3559 2981.3729 2989.5640 3016.4498 3031.7277 3037.1966 3040.5752 3069.1215 3073.0012 3074.5495 3101.9784 3140.4744 3157.2705 3172.7740 3181.5640 3523.6935 3557.9112
redmass: 5.5601 5.3248 5.5998 4.1163 5.9711 3.2047 1.9882 4.1798 3.6512 2.7322 3.5870 3.0325 7.2459 4.2756 4.1234 1.3627 3.9412 3.1312 4.5006 4.7215 4.5803 1.2622 2.7458 6.2392 3.3124 2.6486 2.9886 3.8924 4.9247 2.8455 1.7059 2.5681 5.6509 4.9090 3.7262 3.6902 1.2604 2.8673 1.8702 1.9780 3.1470 1.6976 2.0967 1.8867 1.4823 2.2974 3.9627 1.4158 1.6376 3.8200 1.4815 2.1940 1.8034 3.6194 2.9140 3.5726 2.8316 1.4234 1.7461 1.4034 1.7190 2.6059 1.7800 1.0686 1.3142 3.0783 1.2010 1.3675 1.1589 1.4690 1.2844 1.1045 2.5597 1.2995 1.4550 1.5381 1.3054 1.3668 9.4718 1.2711 1.2158 2.1398 1.0778 1.0812 1.0840 1.0784 2.0694 1.1845 1.0899 1.0628 7.2037 6.5561 9.5959 9.1475 1.0814 1.0600 1.0468 1.0491 1.0608 1.0622 1.0979 1.0974 1.0633 1.0979 1.0996 1.0998 1.1036 1.1078 1.0866 1.0917 1.0952 1.0986 1.0642 1.0660
irintensity: 0.3679 1.8457 1.6933 0.9306 0.5960 0.8693 1.4725 1.0346 1.1227 1.0668 0.4550 3.7910 0.4113 0.6761 2.7772 0.1362 0.5616 2.2003 0.5324 1.7571 1.7741 152.3943 6.0496 6.6952 5.4437 9.8214 4.6406 4.7318 12.8376 9.8464 65.2388 55.5367 11.0401 7.2582 86.4711 13.0368 2.5249 34.7666 16.2218 16.4230 26.9638 10.4656 22.4997 4.8853 3.5965 9.1454 90.0251 20.8783 9.2241 274.0565 36.7016 0.6647 14.4888 50.6510 59.0967 23.3136 2.8124 28.4968 116.4406 22.7693 9.4909 9.6214 84.1158 0.0507 21.3748 229.0502 19.2861 13.9336 0.1399 3.9711 8.3717 3.9864 75.6482 9.1023 3.2240 0.1303 3.7942 5.7804 13.6127 19.0333 16.6170 3.1291 12.4720 7.8962 11.6530 2.4249 4.4292 17.8031 19.8727 5.9029 15.7219 47.3927 126.5828 278.4023 24.2774 8.1970 19.2466 26.8417 31.2220 77.1263 1.5847 2.6122 24.7950 51.2482 51.4837 33.6753 104.0849 11.4478 2.2427 12.4227 5.9576 10.5574 44.7846 6.7256
temp: 298.150 k
press: 1.00000 atm
elementType: 8 8 8 8 8 6 6 6 6 6 6 6 6 6 6 6 6 6 6 6 1 1 1 1 1 1 1 1 1 1 1 1 1 1 1 1 1 1 1 1
symmnumber: 1
zpe: 853897.7 jmol-1
zpe.correction: 0.325232 hartree
zpe.thermalcorrener: 0.346428 hartree
zpe.thermalcorrenthalpy: 0.347372 hartree
zpe.thermalcorrgfe: 0.272298 hartree
zpe.sumelectzpe: -958.194166 hartree
zpe.sumelectthermal: -958.172971 hartree
zpe.sumelectthermalent: -958.172027 hartree
zpe.sumelectthermalfe: -958.247101 hartree
dipole: 3.3845 -3.8948 -0.9700
dipole: 5.2502
quadrupole: -107.8971 -118.8757 -120.9278
quadrupole: 11.1235 -3.9822 -4.7140
quadrupole: 8.0031 -2.9755 -5.0276 11.1235 -3.9822 -4.7140
hfenergy: -958.5193986 hartree
pointgroup: C01 [X(C15H20O5)]
dipole: -1.5957831 1.2543569 -0.3831261 debye
polarizability: 217.4976966|-2.319467|200.2745717|10.8303671|8.1286517|120.2738999 unknown
InChI: InChI=1S/C15H20O5/c1-2-11(6-5-9-16)10-20-15(19)13-8-4-3-7-12(13)14(17)18/h3-4,7-8,11,16-17H,2,5-6,9-10H2,1H3
charge 0 multiplicity 1
40 atoms
O  0.327175 1.44375 0.503778
O  3.770648 -3.382503 0.321765
O  0.155497 -0.606488 1.623195
O  -2.00726 -3.388937 -0.639908
O  -0.079882 -2.122475 -0.883694
C  2.740771 1.615781 -0.095392
C  2.824543 0.212097 -0.754619
C  2.491076 2.712866 -1.167767
C  1.707817 1.669136 1.047218
C  3.282862 -0.929115 0.182404
C  2.574047 4.163383 -0.643516
C  3.39163 -2.268672 -0.569445
C  -0.314755 0.254841 0.844417
C  -1.680921 0.192332 0.219089
C  -2.198801 -1.0157 -0.334303
C  -2.519458 1.32819 0.310996
C  -3.555855 -1.075191 -0.737501
C  -3.866633 1.264905 -0.108449
C  -4.390213 0.056757 -0.620265
C  -1.303793 -2.176095 -0.62323
H  3.719431 1.829185 0.392272
H  1.839231 -0.047187 -1.190945
H  3.532254 0.282119 -1.606188
H  3.241565 2.577603 -1.971886
H  1.499617 2.539654 -1.629605
H  1.904684 0.909792 1.822657
H  1.664443 2.670169 1.506554
H  2.554096 -1.052891 1.007824
H  4.265039 -0.686999 0.635952
H  3.540303 4.351977 -0.137338
H  1.764561 4.390674 0.074211
H  2.484722 4.885896 -1.475227
H  2.433208 -2.487015 -1.082653
H  4.201524 -2.237255 -1.318806
H  3.069319 -3.468877 1.016467
H  -2.110356 2.2538 0.725921
H  -3.939152 -2.010014 -1.155231
H  -4.503848 2.1518 -0.027274
H  -5.436674 -0.001609 -0.936851
H  -1.377167 -4.122481 -0.875128
