program: Gaussian 09
title: 000186435
version: EM64L-G09RevD.01
frameworkgroup: C1[X(C20H9FO2)]
method: RPBEPBE
basis: SDD
operation: Freq
keyword: #p
keyword: freq=noraman
keyword: PBEPBE/SDD
title: #p freq=noraman PBEPBE/SDD
converged: NO YES NO NO
title: Mulliken charges:
elementType: F O O C C C C C C C C C C C C C C C C C C C C H H H H H H H H H
charge: -0.193296 -0.177495 -0.209436 0.135017 0.087528 0.364444 0.278092 0.329536 0.499324 0.247425 0.230531 -0.414588 -0.446957 -0.447219 -0.528616 -0.432168 -0.390664 -0.038697 -0.525690 -0.373519 -0.346537 0.332057 -0.393241 0.236322 0.299910 0.249916 0.294191 0.246283 0.256734 0.301038 0.260308 0.269466
chargesum: 0.00000
title: Mulliken charges with hydrogens summed into heavy atoms:
elementType: F O O C C C C C C C C C C C C C C C C C C C C
charge: -0.193296 -0.177495 -0.209436 0.135017 0.087528 0.364444 0.278092 0.329536 0.499324 0.247425 0.230531 -0.414588 -0.210635 -0.147309 -0.278700 -0.137977 -0.144381 -0.038697 -0.268956 -0.072482 -0.086229 0.332057 -0.123775
polarizability: 4.38844776e+02 8.62676466e+00 2.61319782e+02 -5.74175657e-04 1.98351408e-03 8.02664046e+01
1716.lowfreq: -5.4888 -0.0010 -0.0004 0.0002 7.1598 12.9156 38.7123 75.5243 97.5724
frequency: 38.6985 75.5237 97.5719 105.1549 154.9225 156.4957 202.5266 246.3424 252.1077 266.9028 306.8362 319.8396 342.6805 356.4761 390.1496 410.7492 434.1163 448.2709 458.1431 465.9008 496.0481 499.0772 549.4185 565.7889 572.0152 595.8418 609.6191 631.1747 651.0704 672.8769 684.3652 710.2753 738.3950 756.8710 799.8012 800.8641 834.5507 837.6622 841.0473 869.0835 879.5404 889.2515 900.5977 938.2104 958.3625 975.8382 995.7200 1000.9285 1000.9516 1026.1181 1069.4921 1103.1160 1121.5806 1137.4771 1153.6642 1167.6050 1187.7184 1208.7612 1235.2572 1250.2978 1277.3961 1289.1259 1304.4001 1344.1374 1379.0497 1388.2167 1401.2368 1405.1294 1424.9542 1442.0882 1470.9214 1478.9280 1515.2011 1522.6130 1533.2582 1564.1555 1577.5218 1588.2584 1597.3603 1617.0748 1626.6279 3123.3409 3136.0004 3151.4781 3161.2553 3164.2577 3167.0329 3167.7888 3180.7196 3183.0796
redmass: 9.7055 5.2182 7.3254 8.5092 4.8862 9.0720 4.5816 12.1000 6.9341 4.8090 9.3187 6.0146 10.3456 7.6335 3.9553 7.3943 7.9297 3.3950 7.8611 3.2863 6.2455 4.1949 6.4692 4.7275 5.7459 6.9652 7.7669 3.4948 4.1303 6.6008 7.3775 3.3193 3.3785 7.1876 5.5477 2.3608 6.5394 1.5683 1.8920 1.8471 1.5233 6.9268 2.0808 2.3260 4.8370 1.4713 1.4334 3.7077 1.3981 1.4307 2.6269 2.0452 1.9486 1.5321 1.9318 2.1089 1.6898 1.8766 2.0759 1.5285 2.6764 1.8879 3.8703 2.8515 3.8951 5.2554 2.9398 7.6960 7.8850 4.3125 3.2096 3.7239 7.0554 6.1208 8.9304 6.2357 6.8311 7.3169 7.3145 7.4461 7.5417 1.0893 1.0891 1.0887 1.0894 1.0946 1.0965 1.0964 1.0913 1.0966
irintensity: 0.4121 0.0029 4.0667 5.9573 0.0527 1.3372 7.5729 1.6085 0.0867 0.0999 5.1093 0.0374 0.0093 16.8549 0.2736 3.4096 11.1060 3.0560 3.5313 0.4153 4.2450 3.3353 3.5025 1.4996 5.0983 5.6727 1.7829 1.2332 4.1604 3.7005 6.3558 6.9409 0.6262 6.4042 3.5623 30.5463 2.8395 27.5057 1.0032 1.4526 117.3910 58.3727 0.0874 21.6592 19.9367 0.0672 3.4489 13.4542 0.4525 0.3251 18.5919 9.5525 3.0595 17.2895 49.4589 4.0818 18.3333 15.1355 19.0497 13.5377 36.9896 59.4204 149.5073 50.1494 1.2926 7.4599 17.5893 12.3110 5.1740 12.3645 59.0785 19.4015 193.2060 9.3365 156.1593 30.9600 17.4659 76.0797 61.5090 61.4477 82.5557 12.9590 13.2808 0.6827 1.0670 8.8453 9.2897 4.1659 2.9396 6.2292
temp: 298.150 k
press: 1.00000 atm
elementType: 9 8 8 6 6 6 6 6 6 6 6 6 6 6 6 6 6 6 6 6 6 6 6 1 1 1 1 1 1 1 1 1
symmnumber: 1
zpe: 595909.9 jmol-1
zpe.correction: 0.226970 hartree
zpe.thermalcorrener: 0.242699 hartree
zpe.thermalcorrenthalpy: 0.243643 hartree
zpe.thermalcorrgfe: 0.184134 hartree
zpe.sumelectzpe: -1016.361764 hartree
zpe.sumelectthermal: -1016.346035 hartree
zpe.sumelectthermalent: -1016.345091 hartree
zpe.sumelectthermalfe: -1016.404600 hartree
dipole: 1.6043 -4.5769 0.0005
dipole: 4.8499
quadrupole: -146.3608 -123.7226 -133.1782
quadrupole: 13.6222 0.0006 0.0021
quadrupole: -11.9402 10.6979 1.2423 13.6222 0.0006 0.0021
hfenergy: -1016.5887343 hartree
pointgroup: C01 [X(C20H9F1O2)]
dipole: 0.6048966 1.8096912 -0.0005364 debye
polarizability: 439.0583481|-6.0382915|261.1062031|0.0063694|-0.0333347|80.2664108 unknown
InChI: InChI=1S/C20H9FO2/c21-11-3-5-13-16(9-11)12-4-1-10-2-8-17(22)14-6-7-15(20(13)23)19(12)18(10)14/h1-9H
charge 0 multiplicity 1
32 atoms
F  5.484251 1.855587 -0.00035
O  1.565164 -3.217124 0.000878
O  -5.233786 -1.094122 0.000097
C  -0.419781 -0.08434 0.000047
C  -1.800585 0.329298 -0.000078
C  0.633751 0.906417 -0.000095
C  -0.122991 -1.488937 0.000287
C  2.045343 0.463335 -0.000023
C  -2.133884 1.730851 -0.000341
C  -2.844695 -0.654405 0.000048
C  2.359133 -0.935571 0.00019
C  1.28983 -1.971145 0.000504
C  0.267104 2.269719 -0.000376
C  -1.16727 -2.4374 0.000357
C  -1.088925 2.67641 -0.000487
C  -2.517846 -2.02588 0.000245
C  -3.53347 2.134373 -0.000503
C  -4.287073 -0.235514 0.0000
C  3.124812 1.389615 -0.000186
C  3.709753 -1.373268 0.000182
C  -4.555838 1.213983 -0.000371
C  4.440581 0.913932 -0.000183
C  4.771756 -0.456236 -0.000017
H  1.034849 3.047923 -0.000566
H  -0.894367 -3.497236 0.000532
H  -1.331016 3.745336 -0.000714
H  -3.337881 -2.751214 0.000346
H  -3.756125 3.208608 -0.000764
H  2.967361 2.470371 -0.000284
H  3.893139 -2.451815 0.000351
H  -5.608441 1.515032 -0.000508
H  5.818748 -0.770882 -0.000015
