program: Gaussian 09
title: 000186455
version: EM64L-G09RevD.01
frameworkgroup: C1[X(C13H16BrNO3S)]
method: RPBEPBE
basis: SDD
operation: Freq
keyword: #p
keyword: freq=noraman
keyword: PBEPBE/SDD
title: #p freq=noraman PBEPBE/SDD
converged: NO YES NO NO
title: Mulliken charges:
elementType: Br S O O O N C C C C C C C C C C C C C H H H H H H H H H H H H H H H H
charge: -0.002894 0.152951 -0.255469 -0.244170 -0.281361 -0.395512 -0.148366 -0.634005 -0.856190 0.590347 0.216408 0.261681 -0.400714 -0.315097 -0.185565 -0.242247 -0.771798 -0.242219 -0.492797 0.297847 0.294464 0.313811 0.275539 0.286180 0.343127 0.252259 0.254074 0.236664 0.251690 0.217446 0.253945 0.239543 0.250053 0.239099 0.241279
chargesum: 0.00000
title: Mulliken charges with hydrogens summed into heavy atoms:
elementType: Br S O O O N C C C C C C C C C C C C C
charge: -0.002894 0.152951 -0.255469 -0.244170 -0.281361 -0.052385 0.149480 -0.025731 -0.294472 0.590347 0.216408 0.261681 -0.400714 -0.062838 0.068509 -0.005583 -0.048717 -0.002676 0.237634
polarizability: 2.08147841e+02 -2.44358293e+01 1.96533184e+02 2.28489702e+01 1.66915740e+01 1.49457671e+02
1716.lowfreq: -0.0012 -0.0004 0.0011 2.6473 4.9272 10.3615 12.4252 24.6987 32.2306
frequency: 11.9939 24.6830 32.2280 40.2399 50.0636 63.8912 72.1229 72.8729 91.0019 97.2924 107.8917 135.2693 160.8988 170.9897 193.0954 210.1236 220.5765 275.0247 276.6641 307.5267 309.7288 348.6952 380.3213 440.7857 459.3726 492.1724 501.3136 564.7033 568.7761 589.1393 618.2666 628.2049 639.4317 653.5155 661.0189 729.1301 752.8222 765.0905 805.4876 814.4837 862.9041 883.7273 909.4968 923.4003 953.1055 953.9520 988.9898 994.4015 999.7166 1014.6211 1039.7682 1043.8485 1106.9819 1115.4139 1130.4249 1154.4695 1156.6498 1169.0917 1174.2225 1181.7542 1209.7686 1236.4950 1240.2681 1252.2637 1280.4530 1314.0992 1330.8049 1370.5849 1388.2615 1419.6287 1422.9469 1432.2138 1445.6575 1450.6842 1452.2892 1458.2130 1458.5453 1464.3218 1484.3741 1567.9960 1598.0584 1604.6862 1636.9754 2984.7517 2999.0013 3010.0950 3038.0483 3047.8824 3098.0457 3105.1679 3114.3885 3115.7812 3128.3489 3129.3500 3141.4630 3158.2611 3158.7553 3174.0633 3518.1883
redmass: 6.0726 10.3928 5.1511 5.6957 3.3128 1.4344 2.2328 2.4140 2.2036 4.4164 3.9980 5.2535 3.7086 6.1141 5.3126 4.2786 4.1788 5.5578 4.9543 4.7653 3.4588 4.1353 3.0145 3.3568 4.2172 4.2277 3.7654 5.0321 4.9392 2.4637 1.9260 2.7501 5.7430 4.9313 4.3462 3.4393 5.4897 1.3136 4.7095 3.9946 1.3953 1.8750 2.0393 3.8594 6.4315 1.3872 1.3271 1.6202 7.0160 2.2775 2.1696 1.6560 1.6375 1.2669 1.8144 1.4245 1.1316 3.2705 1.0794 1.5702 2.3483 1.2532 1.3268 1.6809 1.4065 1.4601 1.7097 7.6461 1.2302 2.1127 1.1818 1.1245 1.1114 1.0471 1.0561 1.3186 1.6186 1.1606 1.9814 6.0843 6.7394 7.1133 8.5932 1.0813 1.0358 1.0294 1.0606 1.0566 1.0983 1.1007 1.1036 1.1050 1.0864 1.1088 1.0901 1.0959 1.1045 1.0992 1.0783
irintensity: 0.1301 0.0902 0.1308 0.2742 0.4937 4.5673 6.5256 0.9695 2.2933 8.0886 0.2333 2.2107 1.5848 8.3520 0.2438 3.8636 12.3672 3.6497 8.1352 4.1018 0.8538 10.2852 0.4458 16.1829 8.4010 1.9106 8.9535 14.3148 8.6521 77.3660 23.2731 24.9558 11.8439 26.7699 1.0658 13.8888 4.9837 75.8707 3.5424 9.3841 0.1991 3.1253 13.4657 7.4086 30.1139 1.4480 0.0968 2.9691 59.3029 6.5183 1.8043 14.7988 3.4992 0.3816 4.6273 1.0322 2.2020 186.1996 0.3430 4.9116 0.6796 11.3258 7.5193 9.0673 0.7205 101.4483 75.6725 2.6414 70.1793 23.6953 8.9573 39.1482 9.4516 17.4279 21.3538 21.0276 30.9286 89.9223 258.9567 13.4556 2.7298 215.8542 104.9372 12.6718 9.4423 22.5569 10.9569 4.1796 10.0590 16.8799 2.0554 25.0116 1.3978 0.5606 6.6034 10.9295 13.5447 12.3824 58.9714
temp: 298.150 k
press: 1.00000 atm
elementType: 35 16 8 8 8 7 6 6 6 6 6 6 6 6 6 6 6 6 6 1 1 1 1 1 1 1 1 1 1 1 1 1 1 1 1
symmnumber: 1
zpe: 703015.6 jmol-1
zpe.correction: 0.267765 hartree
zpe.thermalcorrener: 0.289025 hartree
zpe.thermalcorrenthalpy: 0.289969 hartree
zpe.thermalcorrgfe: 0.212717 hartree
zpe.sumelectzpe: -1195.513501 hartree
zpe.sumelectthermal: -1195.492240 hartree
zpe.sumelectthermalent: -1195.491296 hartree
zpe.sumelectthermalfe: -1195.568548 hartree
dipole: -2.6187 4.0503 0.6545
dipole: 4.8673
quadrupole: -124.2274 -128.7446 -126.0186
quadrupole: -2.4739 7.0591 -6.7078
quadrupole: 2.1028 -2.4144 0.3116 -2.4739 7.0591 -6.7078
hfenergy: -1195.781265 hartree
pointgroup: C01 [X(C13H16Br1N1O3S1)]
dipole: 1.3339716 0.3761615 -1.3213883 debye
polarizability: 194.8776911|39.3872428|170.0291357|-23.0790018|10.4901621|189.2318683 unknown
InChI: InChI=1S/C13H16BrNO3S/c1-9(16)15-12(13(17)18-2)8-19-7-10-5-3-4-6-11(10)14/h3-6,12,15H,7-8H2,1-2H3
charge 0 multiplicity 1
35 atoms
Br 1.875414 1.282265 3.32279
S  -0.118666 -1.919204 0.654807
O  -0.570118 1.457706 -1.055747
O  -1.55088 -0.164477 -2.409649
O  -4.324819 -0.809915 1.565891
N  -3.056678 -1.116488 -0.348453
C  -2.13395 -0.029891 -0.007664
C  -1.149972 -0.395585 1.130201
C  1.517328 -1.493673 1.539052
C  2.294508 -0.369753 0.891808
C  -1.405814 0.382587 -1.291153
C  -4.124431 -1.430151 0.474174
C  2.546164 0.883119 1.506313
C  2.839803 -0.563739 -0.409501
C  3.297293 1.899403 0.874531
C  3.598853 0.429992 -1.056185
C  -5.025777 -2.55972 -0.00925
C  3.828434 1.669569 -0.4126
C  0.220132 1.93504 -2.219312
H  -2.722216 0.83504 0.362781
H  -0.462772 0.446286 1.307421
H  -1.725187 -0.622159 2.040595
H  2.075397 -2.443665 1.481737
H  1.285511 -1.290816 2.594722
H  -2.925594 -1.559201 -1.26274
H  2.64323 -1.519475 -0.909545
H  3.470306 2.850826 1.385515
H  4.015068 0.240057 -2.051367
H  -6.068473 -2.200371 -0.039516
H  -4.747594 -2.946684 -1.0043
H  -4.986228 -3.388763 0.718556
H  4.421554 2.450894 -0.899735
H  0.82119 1.107296 -2.628889
H  0.863089 2.72598 -1.810924
H  -0.456607 2.325167 -2.997764
