program: Gaussian 09
title: 000186463
version: EM64L-G09RevD.01
frameworkgroup: C1[X(C20H13NO5)]
method: RPBEPBE
basis: SDD
operation: Freq
keyword: #p
keyword: freq=noraman
keyword: PBEPBE/SDD
title: #p freq=noraman PBEPBE/SDD
converged: YES YES NO NO
title: Mulliken charges:
elementType: O O O O O N C C C C C C C C C C C C C C C C C C C C H H H H H H H H H H H H H
charge: -0.270075 -0.437241 -0.479253 -0.213827 -0.218238 0.012684 -0.170532 -0.293711 -0.200342 0.372984 -0.200823 0.124702 0.237134 -0.722583 -0.001953 0.492585 0.048337 -0.407493 0.310271 -0.491325 0.492669 -0.457277 -0.487849 0.207899 -0.471763 -0.443327 0.239205 0.248792 0.310812 0.216185 0.257431 0.341201 0.331670 0.378501 0.250474 0.304445 0.250602 0.251335 0.287689
chargesum: 0.00000
title: Mulliken charges with hydrogens summed into heavy atoms:
elementType: O O O O O N C C C C C C C C C C C C C C C C C C C C
charge: -0.270075 -0.096039 -0.100752 -0.213827 -0.218238 0.012684 0.068673 -0.044919 0.110471 0.372984 0.015363 0.124702 0.237134 -0.465152 -0.001953 0.492585 0.048337 -0.075823 0.310271 -0.240851 0.492669 -0.152832 -0.237246 0.207899 -0.220428 -0.155638
polarizability: 4.61307992e+02 1.57281939e+01 2.83051257e+02 -1.42622479e+01 2.96570350e+00 1.07442961e+02
1716.lowfreq: -2.9944 0.0005 0.0007 0.0008 6.5783 7.3252 27.0858 31.8527 43.3586
frequency: 27.0796 31.8321 43.3496 66.6307 78.1214 122.6149 138.2195 204.6243 209.4742 218.4932 239.5826 259.5362 282.7448 297.2303 304.5155 321.3443 332.1402 335.5102 376.4644 385.9491 404.9230 430.4026 455.2227 482.1783 487.7336 507.8738 512.3419 528.8303 533.7466 547.4282 560.4211 562.1251 576.2968 588.1481 630.2570 656.8086 683.1297 687.3002 706.1829 716.3825 732.1845 738.4816 780.0819 788.1234 812.7314 816.2351 826.9635 845.0275 866.7822 871.9678 883.2628 920.3193 926.0381 947.1042 982.9382 995.8726 1003.4698 1009.6425 1025.0746 1026.4780 1029.6700 1068.8274 1104.1185 1115.1356 1130.7442 1158.8541 1164.3166 1176.4948 1185.9771 1194.0957 1205.8466 1211.8534 1223.9000 1238.2525 1253.8543 1255.6625 1282.2965 1310.9336 1319.1614 1334.0719 1344.4374 1346.5051 1365.0563 1376.8425 1385.2077 1395.0694 1408.8409 1419.0157 1425.1162 1432.5953 1467.6943 1485.1794 1499.7007 1554.7952 1571.3862 1608.9285 1611.1563 1631.6038 2861.7803 3082.1580 3091.2952 3113.1760 3125.3233 3128.4068 3145.2304 3152.2450 3188.3018 3190.5509 3213.9449 3466.9375 3536.8450
redmass: 14.2632 7.6912 6.0816 6.4586 6.1793 7.5985 6.7538 5.3573 5.4880 5.6530 5.6103 5.8064 7.0848 5.6352 5.5969 5.3816 2.4503 1.8420 5.5799 6.3949 4.7105 5.5317 6.1149 4.2399 4.8266 4.5609 4.1364 5.4053 5.4621 3.9577 2.3647 1.7082 4.2755 6.3001 6.7290 5.3823 5.8988 7.2307 4.5624 6.5609 3.8663 7.0820 4.6646 5.4233 2.9438 1.7498 3.8987 5.7885 2.3481 1.7825 2.1264 1.9127 3.2418 2.5070 1.3699 1.4202 2.2307 4.1703 3.4220 3.4890 1.5029 1.9694 3.3081 1.9097 2.3700 2.2430 1.3538 1.4278 3.9669 1.6584 1.5865 1.6056 1.2856 1.3352 1.4193 1.5134 1.9695 1.5047 2.3462 2.1046 2.3027 1.8372 1.7382 2.9749 2.9150 2.6825 6.2874 3.8085 4.1629 4.0406 3.3929 6.8224 4.2349 5.6784 8.7074 6.7367 6.5528 7.1984 1.0804 1.0866 1.0881 1.0927 1.0912 1.0872 1.0909 1.0984 1.0942 1.0904 1.0946 1.0647 1.0660
irintensity: 0.3906 2.7125 3.2247 3.4061 0.4466 0.6612 0.1728 0.6370 1.2541 4.9030 8.9801 4.0807 5.1112 2.8366 4.6777 2.8265 29.7940 52.5062 19.7566 0.6988 4.7398 1.8625 15.7169 10.5773 1.1942 6.5096 6.7109 2.9396 9.0981 1.7188 70.3404 106.1977 12.6200 0.1636 2.1627 40.5336 7.1904 5.5954 3.4508 7.8481 6.9049 23.5247 8.4571 17.1272 13.8597 4.2650 2.0357 8.8998 35.5212 36.8816 24.0885 69.4343 83.7177 47.1140 0.7246 0.8953 2.3552 22.2278 46.3964 41.0591 5.4271 2.2919 9.4130 3.2497 4.9859 41.6067 37.3984 28.8436 605.3146 25.4546 73.4129 18.7129 2.8727 24.7777 25.3484 22.3182 27.2346 2.3587 24.0850 27.9655 13.5477 75.5957 4.8115 11.1345 37.7983 9.4375 28.2353 9.2382 1.8982 3.4757 21.8752 9.7373 22.1391 14.5835 22.0057 55.1904 12.5756 30.5701 53.4017 0.9187 21.2122 30.2455 5.3484 3.8037 6.0926 27.1509 3.0188 35.7300 1.5265 49.6870 15.3981
temp: 298.150 k
press: 1.00000 atm
elementType: 8 8 8 8 8 7 6 6 6 6 6 6 6 6 6 6 6 6 6 6 6 6 6 6 6 6 1 1 1 1 1 1 1 1 1 1 1 1 1
symmnumber: 1
zpe: 747195.7 jmol-1
zpe.correction: 0.284592 hartree
zpe.thermalcorrener: 0.304095 hartree
zpe.thermalcorrenthalpy: 0.305039 hartree
zpe.thermalcorrgfe: 0.236259 hartree
zpe.sumelectzpe: -1198.918760 hartree
zpe.sumelectthermal: -1198.899257 hartree
zpe.sumelectthermalent: -1198.898313 hartree
zpe.sumelectthermalfe: -1198.967093 hartree
dipole: 5.6430 4.7920 -3.5503
dipole: 8.2104
quadrupole: -159.0061 -142.4844 -151.2307
quadrupole: -27.7724 -18.1910 0.4401
quadrupole: -8.0990 8.4227 -0.3237 -27.7724 -18.1910 0.4401
hfenergy: -1199.2033517 hartree
pointgroup: C01[X(C20H13N1O5)]
dipole: 2.2074345 1.894125 -1.4049483 debye
polarizability: 460.5901532|13.665646|282.2287823|-24.499223|8.3240958|108.9832741 unknown
InChI: InChI=1S/C20H13NO5/c22-17-16-11-5-4-10-13(21(24)25)6-3-8-1-2-9(15(11)14(8)10)7-12(16)19-20(26-19)18(17)23/h1-7,17-20,22-23H
charge 0 multiplicity 1
39 atoms
O  4.924397 1.065052 0.820805
O  5.136138 -2.525935 -0.077452
O  2.387024 -2.782705 0.012422
O  -5.845079 -1.660338 0.511194
O  -4.102142 -2.887038 -0.273274
N  -4.609892 -1.765177 0.129308
C  4.985378 -0.025938 -0.212187
C  4.081066 1.136141 -0.467155
C  4.315455 -1.329132 0.202186
C  2.605494 0.973621 -0.309902
C  2.932744 -1.518836 -0.483656
C  1.996381 -0.319051 -0.279501
C  0.567716 -0.413162 -0.171884
C  1.825262 2.140987 -0.204429
C  -0.227435 0.793178 -0.056609
C  0.420098 2.082062 -0.063102
C  -1.665337 0.727279 0.051552
C  -0.151487 -1.669201 -0.195915
C  -2.347615 -0.553417 0.018655
C  -0.364474 3.287215 0.063002
C  -2.420679 1.952309 0.185991
C  -1.531174 -1.738131 -0.114708
C  -1.737874 3.223362 0.189991
C  -3.778257 -0.539999 0.14745
C  -3.836143 1.894292 0.311972
C  -4.503926 0.667345 0.300303
H  5.951228 -0.107757 -0.728901
H  4.419105 1.948028 -1.122612
H  4.180667 -1.3481 1.295755
H  3.120033 -1.61125 -1.583667
H  2.320475 3.119472 -0.221137
H  5.419598 -2.518732 -1.028802
H  0.428646 -2.589143 -0.267656
H  3.163583 -3.402508 0.090997
H  0.154162 4.252599 0.061049
H  -2.024106 -2.708221 -0.155436
H  -2.335141 4.135876 0.29328
H  -4.403589 2.825131 0.415512
H  -5.589599 0.607422 0.403659
