program: Gaussian 09
title: 000186432
version: EM64L-G09RevD.01
frameworkgroup: C1[X(C11H14Cl2N2O2)]
method: RPBEPBE
basis: SDD
operation: Freq
keyword: #p
keyword: freq=noraman
keyword: PBEPBE/SDD
title: #p freq=noraman PBEPBE/SDD
converged: YES YES NO NO
title: Mulliken charges:
elementType: Cl Cl O O N N C C C C C C C C C C C H H H H H H H H H H H H H H
charge: -0.019409 -0.013199 -0.438221 -0.287605 -0.471190 -0.501113 -0.007409 -0.411992 -0.369691 -0.676804 0.287192 0.527564 -0.461927 -0.347621 -0.025683 -0.179529 -0.124018 0.239961 0.219359 0.215687 0.236463 0.215479 0.293024 0.198082 0.221836 0.225770 0.294605 0.337369 0.248785 0.317395 0.256839
chargesum: 0.00000
title: Mulliken charges with hydrogens summed into heavy atoms:
elementType: Cl Cl O O N N C C C C C C C C C C C
charge: -0.019409 -0.013199 -0.100852 -0.287605 -0.178166 -0.206508 0.232552 0.023054 0.082251 -0.031115 0.287192 0.527564 -0.213143 -0.030226 -0.025683 0.077310 -0.124018
polarizability: 2.59463541e+02 -7.61044958e-01 1.49600899e+02 -2.22510018e+00 1.37139177e+01 9.39071209e+01
1716.lowfreq: -5.0472 -0.0012 -0.0008 0.0008 3.1288 5.4401 20.0628 28.5964 51.9102
frequency: 19.3192 28.5520 51.8820 65.4326 71.5294 90.7616 97.1100 116.2828 165.1571 170.7254 185.8290 191.6005 209.8149 241.9296 247.7743 281.6268 296.6871 320.0255 356.7691 378.2355 420.8797 432.9721 438.5207 446.5874 489.7285 564.8048 595.1720 639.1437 661.1303 674.2658 686.7883 710.9174 756.6586 784.0883 827.1051 833.3032 855.4621 868.5228 891.9014 951.9449 975.5550 981.5734 994.6948 1015.3679 1042.8507 1070.4438 1114.6056 1122.1058 1142.8509 1151.1924 1195.7266 1206.2889 1240.5262 1253.1194 1280.4253 1287.9441 1326.9958 1331.4964 1345.3016 1351.9737 1376.5286 1393.4332 1398.8711 1453.6841 1468.2721 1468.3844 1474.6817 1480.5717 1484.4871 1500.1468 1579.5083 1606.5860 1642.4412 2979.2649 2984.4779 2993.2224 3007.5871 3039.0126 3072.5766 3080.5575 3085.7289 3140.6922 3166.0343 3200.5970 3525.8513 3541.6812 3555.0739
redmass: 5.7020 6.1680 4.6987 6.1398 5.7189 2.5381 2.5530 4.9242 3.6064 4.3586 4.8089 4.2768 1.9827 2.5920 1.8459 4.2222 3.9386 3.9911 3.3086 2.6482 3.6412 2.4431 3.2730 2.5233 6.1905 2.0513 1.8426 6.1441 5.8431 5.5304 3.1302 8.0959 2.7707 1.8739 2.5322 1.3299 1.6441 3.7978 2.3766 2.2692 1.3075 1.6164 5.2742 3.5358 2.2208 2.5892 1.6428 2.2122 1.4304 2.1065 1.4024 1.7024 1.4067 1.6446 1.2567 2.1713 1.3262 1.5181 1.6154 2.1555 1.2465 5.6175 1.2104 1.5564 1.4135 1.4859 1.1718 1.1823 1.0775 2.4748 5.6033 6.4859 4.4058 1.0363 1.0641 1.0656 1.0805 1.0990 1.0996 1.0997 1.1015 1.0923 1.0909 1.0952 1.0766 1.0771 1.0656
irintensity: 0.1589 0.4586 13.0662 1.9916 7.0412 2.0703 3.1931 0.4116 9.5739 0.7740 0.2680 4.9870 4.2605 36.8299 97.9445 26.8171 13.6853 21.9930 7.2852 5.0081 15.8529 21.5848 5.1011 10.6145 20.7729 84.6473 49.4392 11.0153 2.8276 11.3770 6.9974 21.9838 5.1344 6.6966 17.2290 12.6671 71.6871 15.6714 22.9289 19.0665 3.4851 44.4896 32.6601 35.1998 15.3384 12.6443 12.8048 66.5450 2.4787 12.4222 58.5745 191.2818 20.4891 83.9510 5.3475 19.2261 34.8797 14.2661 33.8809 101.3220 21.0266 5.2908 13.1858 448.8716 86.2287 41.5695 10.1192 24.7160 17.4760 628.9020 109.6926 84.7755 149.2038 30.8656 20.3157 23.5156 20.0568 6.4936 61.1874 42.8053 51.6615 5.9037 1.6344 12.2791 4.9887 29.3857 2.5489
temp: 298.150 k
press: 1.00000 atm
elementType: 17 17 8 8 7 7 6 6 6 6 6 6 6 6 6 6 6 1 1 1 1 1 1 1 1 1 1 1 1 1 1
symmnumber: 1
zpe: 623541.1 jmol-1
zpe.correction: 0.237494 hartree
zpe.thermalcorrener: 0.255929 hartree
zpe.thermalcorrenthalpy: 0.256874 hartree
zpe.thermalcorrgfe: 0.188382 hartree
zpe.sumelectzpe: -1606.369429 hartree
zpe.sumelectthermal: -1606.350994 hartree
zpe.sumelectthermalent: -1606.350050 hartree
zpe.sumelectthermalfe: -1606.418542 hartree
dipole: 3.4411 2.8959 -0.7265
dipole: 4.5558
quadrupole: -131.7659 -109.8078 -120.0081
quadrupole: 8.0656 -9.1797 2.0842
quadrupole: -11.2386 10.7195 0.5191 8.0656 -9.1797 2.0842
hfenergy: -1606.6069236 hartree
pointgroup: C01 [X(C11H14Cl2N2O2)]
dipole: 1.3691865 1.1170832 -0.3001824 debye
polarizability: 259.3932971|-2.3430891|149.8347803|-2.8075691|13.3712244|93.7434833 unknown
InChI: InChI=1S/C11H14Cl2N2O2/c1-2-7(6-16)14-11(17)15-8-3-4-9(12)10(13)5-8/h3-5,7,14-16H,2,6H2,1H3
charge 0 multiplicity 1
31 atoms
Cl -4.821988 2.139989 0.587547
Cl -5.80802 -0.908041 -0.22414
O  4.338438 -0.225499 2.230058
O  1.167057 -1.516388 -0.388039
N  2.421955 0.394614 0.074735
N  0.078154 0.525934 0.112214
C  3.71734 -0.276586 -0.19565
C  4.773478 0.763916 -0.633448
C  4.169768 -1.082772 1.047462
C  4.4197 1.511653 -1.936764
C  1.215226 -0.284807 -0.091511
C  -1.283629 0.138854 0.022538
C  -2.259565 1.13423 0.297673
C  -1.706153 -1.173301 -0.326307
C  -3.629111 0.823755 0.224799
C  -3.082599 -1.463142 -0.393293
C  -4.05223 -0.475967 -0.120764
H  3.54819 -1.002811 -1.015512
H  4.949919 1.475866 0.198045
H  5.728559 0.22269 -0.772973
H  3.442961 -1.895512 1.242664
H  5.164839 -1.522893 0.867104
H  2.439281 1.407078 0.209963
H  3.489175 2.102472 -1.84338
H  4.276796 0.804011 -2.774276
H  5.227756 2.210674 -2.217915
H  0.236974 1.504949 0.359214
H  3.43839 0.088318 2.501748
H  -1.962832 2.153288 0.569521
H  -0.959984 -1.940325 -0.536823
H  -3.412546 -2.470945 -0.661987
