program: Gaussian 09
title: 000186430
version: EM64L-G09RevD.01
frameworkgroup: C1[X(C10H13ClN2O2)]
method: RPBEPBE
basis: SDD
operation: Freq
keyword: #p
keyword: freq=noraman
keyword: PBEPBE/SDD
title: #p freq=noraman PBEPBE/SDD
converged: YES YES NO NO
title: Mulliken charges:
elementType: Cl O O N N C C C C C C C C C C H H H H H H H H H H H H H
charge: -0.072762 -0.489148 -0.304303 -0.411892 -0.491473 -0.041178 -0.338377 -0.696834 0.280242 0.487065 -0.439227 -0.325653 -0.188121 -0.201071 -0.118609 0.213986 0.251456 0.222473 0.313043 0.212566 0.231644 0.226617 0.291401 0.220834 0.314022 0.349734 0.251838 0.251729
chargesum: 0.00000
title: Mulliken charges with hydrogens summed into heavy atoms:
elementType: Cl O O N N C C C C C C C C C C
charge: -0.072762 -0.139414 -0.304303 -0.098849 -0.200072 0.172808 0.135551 -0.026007 0.280242 0.487065 -0.218393 -0.011631 0.063717 0.050658 -0.118609
polarizability: 2.40219676e+02 1.60271091e+00 1.29323559e+02 -7.37854955e+00 -2.48704936e+00 7.22837924e+01
1716.lowfreq: -13.1184 -5.3558 0.0006 0.0014 0.0018 2.9183 16.7562 37.0954 46.8435
frequency: 16.5349 36.5158 46.7285 63.9636 81.7714 114.0969 141.6179 211.4076 220.4828 224.6444 248.6994 286.1234 292.1930 316.8347 345.6478 380.9597 411.5973 428.1197 449.2214 469.7839 509.4801 524.0270 618.6682 625.3286 659.1307 698.8064 704.8506 724.8571 805.2408 808.6367 832.0590 844.5165 893.9295 931.0592 931.5845 979.5482 981.1570 991.3011 1065.3350 1073.1298 1089.8391 1110.6488 1113.7534 1125.3577 1182.7933 1189.0687 1224.6560 1263.9325 1271.1860 1294.0860 1312.3523 1335.1507 1362.3116 1386.2369 1388.4221 1401.4665 1457.0090 1469.5378 1472.1646 1475.6499 1488.9324 1505.3587 1592.5503 1609.3389 1641.5015 2966.4712 2980.5779 2987.2615 3073.0951 3082.4801 3090.6609 3116.7870 3163.2241 3169.4135 3194.1154 3526.8862 3539.3225 3582.4904
redmass: 5.2537 3.6865 4.6142 5.9242 6.7734 5.6746 5.6331 1.4878 2.6021 3.0121 3.3110 1.2045 4.7105 4.5946 4.4419 4.8375 3.0415 4.3022 1.9040 1.6324 2.9017 3.0223 2.6618 1.6780 6.1118 4.2116 6.4250 5.2205 3.2791 1.4385 5.2963 1.4026 1.6069 1.3718 1.8575 1.3109 3.5286 4.2770 1.7501 2.5750 2.3758 2.2865 1.3710 3.4550 1.1131 1.1978 1.7589 1.2112 2.0275 1.4123 1.2938 1.3241 4.1454 1.5921 1.2363 4.6438 1.0997 1.0523 1.1384 1.7818 2.1260 2.5480 6.4605 6.0776 4.3235 1.0800 1.0378 1.0701 1.0989 1.0965 1.0994 1.0900 1.0911 1.0951 1.0952 1.0765 1.0767 1.0664
irintensity: 1.1359 0.7411 2.4705 0.6325 10.4912 8.6858 1.1482 0.1039 0.0496 1.8938 1.6061 124.4228 29.5799 0.3338 19.3241 43.2781 0.0221 0.0825 15.1590 2.0153 29.6017 11.7001 70.7925 135.3641 18.2524 7.2384 2.7167 8.6327 23.4326 50.4557 3.5041 59.6833 12.3969 0.7728 7.6801 3.3776 10.4041 26.2011 13.9947 44.4968 95.8618 21.0387 11.7558 1.3051 8.3859 10.7752 281.8197 104.8195 11.1442 26.9151 16.2576 4.7691 127.8032 22.1724 8.2285 8.2121 31.8506 16.5186 86.9682 212.0523 42.0327 907.5089 25.4619 26.7627 180.4530 14.0707 24.1703 95.0969 33.7718 2.0227 34.0323 18.2919 3.6240 3.3409 10.7766 6.4263 67.0484 4.8146
temp: 298.150 k
press: 1.00000 atm
elementType: 17 8 8 7 7 6 6 6 6 6 6 6 6 6 6 1 1 1 1 1 1 1 1 1 1 1 1 1
symmnumber: 1
zpe: 575557.4 jmol-1
zpe.correction: 0.219218 hartree
zpe.thermalcorrener: 0.234813 hartree
zpe.thermalcorrenthalpy: 0.235757 hartree
zpe.thermalcorrgfe: 0.173999 hartree
zpe.sumelectzpe: -1107.768384 hartree
zpe.sumelectthermal: -1107.752789 hartree
zpe.sumelectthermalent: -1107.751845 hartree
zpe.sumelectthermalfe: -1107.813603 hartree
dipole: 6.0167 3.3150 1.0409
dipole: 6.9479
quadrupole: -86.9746 -89.7345 -97.5541
quadrupole: 0.2418 7.9627 -0.1456
quadrupole: 4.4465 1.6866 -6.1331 0.2418 7.9627 -0.1456
hfenergy: -1107.9876023 hartree
pointgroup: C01 [X(C10H13Cl1N2O2)]
dipole: 2.3292574 -1.2627166 -0.6724941 debye
polarizability: 240.098695|-5.8379812|128.3908865|5.7077858|8.3099513|73.3374453 unknown
InChI: InChI=1S/C10H13ClN2O2/c1-7(14)6-12-10(15)13-9-4-2-8(11)3-5-9/h2-5,7,12-14H,6H2,1H3
charge 0 multiplicity 1
28 atoms
Cl -6.06784 0.464327 -0.160591
O  4.501769 -1.462449 -0.590569
O  0.834309 1.459355 0.619325
N  2.193135 -0.433338 0.430989
N  -0.124152 -0.671383 0.236797
C  4.415151 0.022064 -0.543361
C  3.444928 0.302497 0.6156
C  5.793734 0.659289 -0.32068
C  0.95927 0.208274 0.439972
C  -1.502632 -0.347071 0.15412
C  -2.416312 -1.417712 -0.055145
C  -2.001922 0.979882 0.268163
C  -3.801922 -1.17843 -0.150882
C  -3.389269 1.218694 0.170797
C  -4.272639 0.143385 -0.036878
H  3.963638 0.388176 -1.489949
H  3.196248 1.375782 0.668838
H  3.932733 0.005033 1.565544
H  2.301737 -1.41753 0.1755
H  6.474254 0.452041 -1.167715
H  6.256263 0.263136 0.600956
H  5.705804 1.757191 -0.224746
H  0.0948 -1.666507 0.156336
H  -2.046766 -2.447312 -0.144531
H  -1.301885 1.800319 0.434328
H  5.131462 -1.734764 -1.303451
H  -4.498164 -2.006573 -0.311118
H  -3.773233 2.239324 0.258751
