program: Gaussian 09
title: 000186448
version: EM64L-G09RevD.01
frameworkgroup: C1[X(C16H18O7)]
method: RPBEPBE
basis: SDD
operation: Freq
keyword: #pfreq=noraman
keyword: PBEPBE/SDD
title: #p freq=noraman PBEPBE/SDD
converged: YES YES NO NO
title: Mulliken charges:
elementType: O O O O O O O C C C C C C C C C C C C C C C C H H H H H H H H H H H H H H H H H H
charge: -0.280012 -0.414310 -0.278589 -0.223658 -0.232393 -0.434621 -0.283492 -0.051473 -0.440176 -0.549205 -0.311663 -0.534052 0.319886 0.164856 0.169866 -0.777434 0.168143 0.223679 -0.370447 -0.342675 -0.223291 -0.217442 0.087523 0.262013 0.206716 0.266781 0.262654 0.257886 0.224230 0.264025 0.308641 0.223990 0.240829 0.262936 0.252685 0.382726 0.266623 0.267062 0.237223 0.236183 0.407778
chargesum: 0.00000
title: Mulliken charges with hydrogens summed into heavy atoms:
elementType: O O O O O O O C C C C C C C C C C C C C C C C
charge: -0.280012 -0.031584 -0.278589 -0.223658 -0.232393 -0.026843 -0.283492 0.210540 0.033321 -0.028665 0.176592 -0.001421 0.319886 0.164856 0.169866 -0.020984 0.168143 0.223679 -0.103825 -0.075613 0.013932 0.018741 0.087523
polarizability: 2.52656523e+02 1.35191181e+01 2.08520523e+02 2.65509558e+01 -8.71754582e+00 1.25559455e+02
1716.lowfreq: -1.7022 -0.0005 0.0001 0.0005 6.4568 13.1454 24.8087 29.7515 37.8861
frequency: 24.7454 29.7352 37.8739 54.4432 59.7069 76.1080 83.9674 87.9759 115.8057 125.7841 138.1861 143.1919 153.7958 165.6137 177.1283 199.5626 202.4000 232.4356 242.3609 260.6942 272.9644 341.4097 355.2790 364.8732 391.4076 406.2741 408.0121 485.7169 498.4359 507.5235 533.3028 544.0751 564.4549 577.5306 619.8132 629.3713 646.2190 658.7720 670.9349 708.8611 758.7211 764.0112 782.7450 788.9285 808.2473 827.1077 851.2766 863.3451 882.9305 900.5198 943.5782 950.3287 957.8639 972.5548 993.4047 1001.6926 1005.3740 1022.6301 1030.3127 1041.1124 1046.5683 1081.2120 1084.8474 1117.7554 1123.9966 1131.8430 1175.9750 1190.2907 1202.7247 1216.6846 1227.9995 1241.4726 1247.9334 1253.5583 1276.5188 1278.3258 1310.8406 1313.0822 1339.1681 1354.1125 1371.4337 1373.5501 1379.9558 1383.2000 1409.7160 1431.8511 1436.5847 1436.9849 1447.6214 1450.3844 1471.7233 1474.7873 1478.7737 1579.2888 1595.1644 1607.4863 1613.3309 1628.8506 1668.2366 2816.1733 2963.3679 2981.3165 2983.7687 2990.5281 2997.1238 3011.5925 3048.0432 3053.2746 3061.5747 3073.8861 3077.9797 3129.9346 3137.0294 3150.9719 3164.4192 3174.7898 3511.5783
redmass: 4.6110 8.1860 7.5834 6.2611 7.1168 5.3596 4.8048 5.4667 6.8936 2.1945 3.2914 4.4126 1.8788 3.2840 3.4028 4.4226 6.8584 5.5099 4.9572 3.9597 4.4398 8.0196 2.6472 4.4386 3.0235 5.6562 3.7199 3.5813 3.0358 2.2673 2.7886 4.4629 4.4566 3.9511 3.6625 6.4345 1.4001 5.8413 6.0686 3.9574 3.5641 1.5948 2.4746 2.0282 5.6014 2.6895 3.1726 3.2494 2.5321 1.4619 4.5057 1.7110 2.1923 1.4150 1.7380 1.3539 1.2365 1.6930 3.1136 3.1389 3.9029 2.6509 3.0351 2.0360 1.9749 2.0759 1.0614 1.5890 1.1863 1.4747 2.6624 1.6981 1.4997 1.8771 1.4940 1.5145 1.2473 1.4832 1.4063 1.3886 1.4955 1.4104 6.4796 1.6636 1.6449 2.2600 1.0947 1.0917 1.1053 1.0514 1.1203 1.7333 1.3562 7.1109 5.6067 6.2079 6.6102 11.8704 8.2171 1.0730 1.0624 1.0397 1.0647 1.0620 1.0635 1.0801 1.0967 1.0956 1.0953 1.1037 1.0971 1.1003 1.0860 1.0906 1.0952 1.1001 1.0640
irintensity: 0.8758 2.9042 2.0877 1.0586 0.8320 4.2375 0.9879 0.5523 0.3172 0.8222 5.3075 3.8224 5.5208 0.4682 1.9748 10.0615 2.8303 2.3267 3.1048 2.7617 23.3926 2.5261 6.0148 2.8991 11.2610 1.5436 8.5665 22.5907 10.9522 25.1359 7.1050 15.7921 7.0170 20.5012 18.6756 7.8851 126.3023 19.3749 4.0032 48.8239 12.4158 14.7203 30.9490 31.8553 4.2049 1.9949 16.2141 1.3901 3.7494 1.9511 8.4328 26.5628 1.8526 2.2972 15.7868 2.6224 194.5299 46.7657 192.6410 160.0850 18.9883 171.2172 193.5503 13.6645 15.0465 1.8384 1.5168 31.4084 5.7515 6.7992 104.3294 41.6886 55.4050 267.8877 55.5274 14.6045 7.0110 104.7124 16.6362 13.2983 44.8992 91.7981 6.2576 3.9138 51.1239 6.7042 53.5273 20.3072 4.2551 21.7981 22.5319 33.1647 0.9560 24.5013 95.5111 152.8912 133.4972 201.3554 192.5677 1709.0789 88.7100 3.0455 22.7011 14.3464 14.0314 15.7928 5.9742 9.2989 5.9300 14.5020 14.3004 14.2228 2.0903 8.0162 8.7498 19.1350 28.3886
temp: 298.150 k
press: 1.00000 atm
elementType: 8 8 8 8 8 8 8 6 6 6 6 6 6 6 6 6 6 6 6 6 6 6 6 1 1 1 1 1 1 1 1 1 1 1 1 1 1 1 1 1 1
symmnumber: 1
zpe: 829757.5 jmol-1
zpe.correction: 0.316038 hartree
zpe.thermalcorrener: 0.338835 hartree
zpe.thermalcorrenthalpy: 0.339779 hartree
zpe.thermalcorrgfe: 0.262142 hartree
zpe.sumelectzpe: -1145.392771 hartree
zpe.sumelectthermal: -1145.369974 hartree
zpe.sumelectthermalent: -1145.369030 hartree
zpe.sumelectthermalfe: -1145.446667 hartree
dipole: 3.9809 2.2218 -1.0142
dipole: 4.6704
quadrupole: -98.7943 -132.5556 -143.5477
quadrupole: 10.1725 7.2387 3.5480
quadrupole: 26.1716 -7.5898 -18.5818 10.1725 7.2387 3.5480
hfenergy: -1145.7088092 hartree
pointgroup: C01 [X(C16H18O7)]
dipole: -1.5253416 -0.9800232 -0.2986812 debye
polarizability: 247.8802072|15.5883966|210.6848901|-33.3994258|3.94122|128.1714041 unknown
InChI: InChI=1S/C16H18O7/c1-10(17)6-7-11(8-14(18)19)9-23-16(22)13-5-3-2-4-12(13)15(20)21/h2-5,11,18,20H,6-9H2,1H3
charge 0 multiplicity 1
41 atoms
O  0.117949 1.052586 -0.098387
O  -5.489758 2.001625 0.436549
O  -0.271065 -3.708748 -0.212247
O  -3.786269 2.814228 -0.914811
O  0.89038 2.640829 1.429844
O  1.76666 -2.134728 -0.712571
O  1.207239 -1.141612 1.309139
C  -2.190004 0.391518 -0.491377
C  -1.768776 -1.089598 -0.697439
C  -3.647849 0.514753 0.014474
C  -1.256394 1.179599 0.443862
C  -1.775677 -1.960666 0.595576
C  -1.384264 -3.405334 0.320026
C  -4.257259 1.886518 -0.222567
C  1.122115 1.748106 0.582641
C  -2.355476 -4.501598 0.70611
C  2.477083 1.325682 0.104762
C  2.793491 -0.035017 -0.173211
C  3.44867 2.330786 -0.1125
C  4.054791 -0.359515 -0.724743
C  4.714972 1.996399 -0.638934
C  5.012488 0.651541 -0.959396
C  1.849335 -1.133325 0.22077
H  -2.136503 0.880676 -1.483897
H  -2.452015 -1.539301 -1.446359
H  -0.755991 -1.109137 -1.134772
H  -4.294584 -0.217765 -0.508784
H  -3.741539 0.283228 1.092305
H  -1.251365 0.778536 1.475979
H  -1.534886 2.247329 0.479334
H  -1.012894 -1.558051 1.293993
H  -2.764599 -1.935447 1.086527
H  -3.329795 -4.34059 0.206503
H  -1.956469 -5.491865 0.440586
H  -2.550448 -4.458825 1.795129
H  -5.879922 2.899128 0.251092
H  3.19398 3.3692 0.122785
H  4.278124 -1.406036 -0.952511
H  5.460159 2.780847 -0.807832
H  5.989046 0.389801 -1.380519
H  1.013113 -2.805656 -0.482528
