program: Gaussian 09
title: 000186423
version: EM64L-G09RevD.01
frameworkgroup: C1[X(C18H21NO3S)]
method: RPBEPBE
basis: SDD
operation: Freq
keyword: #p
keyword: freq=noraman
keyword: PBEPBE/SDD
title: #p freq=noraman PBEPBE/SDD
converged: YES YES NO NO
title: Mulliken charges:
elementType: S O O O N C C C C C C C C C C C C C C C C C C H H H H H H H H H H H H H H H H H H H H H
charge: 0.919131 -0.307062 -0.542937 -0.523495 -0.348800 0.003592 -0.426477 -0.232021 -0.359912 -0.415295 0.488884 0.004242 -0.697716 -0.387552 -0.392109 -0.268439 -0.211677 -0.230878 -0.268355 -0.246080 -0.210454 -0.222244 -0.222149 0.252919 0.288151 0.215394 0.274402 0.228167 0.222014 0.256647 0.196881 0.237797 0.217702 0.214166 0.248868 0.259327 0.287088 0.299833 0.223706 0.230020 0.229074 0.239276 0.241106 0.235263
chargesum: 0.00000
title: Mulliken charges with hydrogens summed into heavy atoms:
elementType: S O O O N C C C C C C C C C C C C C C C C C C
charge: 0.919131 -0.307062 -0.542937 -0.523495 -0.348800 0.256511 0.077069 0.042381 0.090269 0.038233 0.488884 0.004242 -0.028052 -0.138684 -0.132782 0.018649 0.088156 -0.007172 -0.038335 -0.017006 0.028823 0.018863 0.013114
polarizability: 2.52819040e+02 -1.89660548e+01 2.41097889e+02 -1.97282213e+01 -5.88065494e+00 1.92800984e+02
1716.lowfreq: -9.6159 -6.4739 -3.8149 0.0015 0.0015 0.0020 19.8237 30.3787 37.9072
frequency: 19.5071 30.3506 37.8813 50.1290 55.4942 65.0155 80.2292 82.5028 101.1247 113.2451 138.2292 164.1378 181.8172 185.5378 198.7950 210.5591 224.1994 247.3307 257.1806 278.0655 299.8395 323.0155 354.6649 377.9816 401.0457 401.7267 405.2058 430.0077 450.6452 489.5365 501.3368 514.3917 559.1738 603.1657 615.5300 626.8496 657.3307 685.7909 690.0788 702.1795 730.9725 759.9341 765.7313 788.2839 807.5430 825.4517 850.9688 854.6407 857.9980 885.5085 915.7707 919.7714 934.9047 938.2516 971.1059 977.4522 979.3343 986.5124 992.3699 996.2064 1003.0208 1008.9186 1025.0563 1028.2268 1046.2728 1047.5537 1048.4516 1070.9934 1078.7017 1084.5696 1090.3219 1108.0911 1124.4651 1138.8644 1171.6341 1172.4858 1179.1341 1194.1660 1212.6118 1228.4784 1235.8137 1258.1081 1295.3504 1304.0139 1314.8378 1316.3457 1336.1483 1343.6880 1383.2117 1383.5442 1387.8302 1390.6974 1435.5961 1438.2786 1453.5895 1454.7303 1475.0785 1478.2142 1482.0094 1486.2796 1496.2770 1577.5785 1591.1334 1604.0902 1612.0293 2941.7031 2958.3047 2979.0429 2995.2669 3018.6336 3057.5001 3067.0323 3079.2243 3083.8879 3114.4335 3121.0392 3128.7729 3135.5768 3141.9199 3147.8868 3157.3285 3157.5819 3166.3124 3170.8577 3174.2885 3174.5815
redmass: 4.9197 5.5253 5.0941 4.1450 4.2246 4.4591 3.7635 5.6229 2.6230 4.0678 5.7219 5.4113 4.0525 1.4186 5.7584 3.4410 9.0787 7.9377 2.6147 3.2204 3.5576 5.8142 5.9856 7.5257 3.5158 2.9656 2.8946 3.2538 3.4345 3.6353 3.8145 4.6422 4.4693 6.4659 6.2239 3.9261 7.1112 6.1640 2.4556 1.9094 2.0218 1.4161 1.6628 13.6573 3.0100 1.7157 1.2548 1.9148 1.6255 2.0413 1.9884 5.4156 1.6479 1.3794 1.7842 4.9568 1.4464 1.4374 5.6335 1.3133 1.3452 4.1007 2.3810 1.4280 2.0710 2.2277 2.8649 2.0655 1.5681 1.7973 1.5967 1.3756 2.0832 1.6934 1.0604 1.0544 1.1163 1.1188 2.2636 1.3675 1.3320 1.3068 1.3043 1.2989 1.3170 1.2610 1.3380 1.3343 6.9717 8.2195 1.8607 1.2295 2.2572 2.1696 1.7905 1.1547 1.0454 1.1949 1.3037 1.4568 1.1515 5.8450 5.9146 6.9280 5.9429 1.0822 1.0580 1.0361 1.0661 1.1012 1.0959 1.0532 1.0978 1.1002 1.0918 1.0851 1.0885 1.0857 1.0936 1.0888 1.0970 1.0934 1.0965 1.0972 1.1179 1.1017
irintensity: 0.4938 0.1870 0.4683 1.2715 1.6633 4.3585 6.2657 2.4372 2.4016 0.8166 0.9186 0.6493 4.0428 0.0894 5.6682 1.4174 1.0563 8.4081 2.7346 0.5621 8.1062 0.9479 3.0786 13.0344 18.7244 7.5322 0.8933 5.1214 21.8277 13.8692 19.2305 74.6314 56.2464 0.2988 0.0859 0.4234 10.0287 16.7287 28.3560 47.2814 34.1976 73.2532 59.2483 69.2729 40.9153 3.9694 0.2799 1.1437 5.4115 6.9663 48.8845 62.2904 4.4370 4.1913 0.8015 2.4049 0.3448 0.3376 0.1139 0.1158 0.3699 2.1033 4.7851 1.4734 19.8085 21.9720 4.6233 28.9433 0.8802 2.4788 8.6164 9.3411 9.7598 0.8125 1.0206 0.2124 4.9301 1.0789 13.6998 4.5126 3.1178 4.4945 17.6291 2.2214 0.8326 11.3521 4.6567 8.1717 0.8536 3.7594 5.6912 14.5193 14.3342 13.3507 17.8840 8.3182 9.5718 1.6524 10.2491 11.9191 17.1313 4.0977 0.6595 0.3104 0.8893 11.2897 50.9043 37.6147 24.8545 9.6683 4.1174 34.7880 30.8444 44.7037 10.2056 1.1358 2.9954 1.8153 26.3003 14.4644 20.7733 11.6551 2.4157 7.2181 19.5749 36.5209
temp: 298.150 k
press: 1.00000 atm
elementType: 16 8 8 8 7 6 6 6 6 6 6 6 6 6 6 6 6 6 6 6 6 6 6 1 1 1 1 1 1 1 1 1 1 1 1 1 1 1 1 1 1 1 1 1
symmnumber: 1
zpe: 915844.3 jmol-1
zpe.correction: 0.348827 hartree
zpe.thermalcorrener: 0.371881 hartree
zpe.thermalcorrenthalpy: 0.372826 hartree
zpe.thermalcorrgfe: 0.294783 hartree
zpe.sumelectzpe: -1375.068569 hartree
zpe.sumelectthermal: -1375.045514 hartree
zpe.sumelectthermalent: -1375.044570 hartree
zpe.sumelectthermalfe: -1375.122612 hartree
dipole: -1.0022 -0.6220 3.9764
dipole: 4.1476
quadrupole: -126.3922 -132.7924 -154.7537
quadrupole: -8.9917 -11.3796 -11.4315
quadrupole: 11.5873 5.1870 -16.7743 -8.9917 -11.3796 -11.4315
hfenergy: -1375.4173956 hartree
pointgroup: C01 [X(C18H21N1O3S1)]
dipole: -0.328613 -1.5750356 0.2720849 debye
polarizability: 226.0011115|16.7988811|193.5656673|4.6050173|-11.4924968|267.1511337 unknown
InChI: InChI=1S/C18H21NO3S/c1-2-18(15-9-5-3-6-10-15)19(13-16-14-22-16)23(20,21)17-11-7-4-8-12-17/h3-12,16,18H,2,13-14H2,1H3
charge 0 multiplicity 1
44 atoms
S  -1.189647 1.50688 -0.286208
O  0.638707 -2.069401 -3.335616
O  -2.472728 1.875449 -1.239898
O  -0.245723 2.68667 0.329782
N  -0.167192 0.176273 -1.253271
C  -0.708043 -1.475859 -2.954685
C  -0.702657 0.006106 -2.631121
C  1.335792 0.338596 -1.17199
C  -0.47643 -1.965313 -4.35044
C  1.899525 1.65844 -1.767832
C  1.828929 -0.019811 0.234348
C  -1.89416 0.499106 1.15575
C  3.409559 1.561227 -2.078502
C  1.765775 -1.377048 0.644243
C  2.347069 0.939317 1.13996
C  -3.204252 0.01567 1.010171
C  -1.110875 0.315142 2.305068
C  2.203279 -1.76995 1.927106
C  2.789895 0.549441 2.425512
C  2.718696 -0.804847 2.825241
C  -3.758881 -0.708558 2.090832
C  -1.68485 -0.412573 3.373516
C  -2.999666 -0.924152 3.265235
H  -1.267048 -2.106781 -2.252207
H  -1.736067 0.406723 -2.660089
H  -0.113212 0.553911 -3.394801
H  1.661717 -0.484743 -1.846602
H  -0.904501 -2.924509 -4.664816
H  -0.297236 -1.237205 -5.151897
H  1.68642 2.502426 -1.090613
H  1.357321 1.878899 -2.708394
H  4.000915 1.372718 -1.164883
H  3.776129 2.500715 -2.530205
H  3.618154 0.738776 -2.788763
H  1.366903 -2.123962 -0.052759
H  2.393025 1.993726 0.853561
H  -3.770919 0.226781 0.097668
H  -0.098019 0.722902 2.37321
H  2.149602 -2.823392 2.224111
H  3.189497 1.304129 3.112427
H  3.067651 -1.106264 3.819545
H  -4.780625 -1.095156 2.015197
H  -1.100632 -0.577187 4.284697
H  -3.435898 -1.484614 4.099314
