program: Gaussian 09
title: 000186413
version: EM64L-G09RevD.01
frameworkgroup: C1[X(C21H19FO2)]
method: RPBEPBE
basis: SDD
operation: Freq
keyword: #p
keyword: freq=noraman
keyword: PBEPBE/SDD
title: #p freq=noraman PBEPBE/SDD
converged: YES YES NO NO
title: Mulliken charges:
elementType: F O O C C C C C C C C C C C C C C C C C C C C C H H H H H H H H H H H H H H H H H H H
charge: -0.203701 -0.255567 -0.426888 -0.385200 0.209901 -0.322999 0.183381 0.371422 0.117972 -0.011267 0.095799 0.335547 0.020089 -0.455535 -0.360722 -0.863439 -0.825043 -0.426115 0.169655 -0.247584 -0.257326 -0.235180 -0.396653 -0.512610 0.253078 0.228529 0.244137 0.263039 0.233466 0.235451 0.284289 0.259143 0.232476 0.246939 0.347521 0.254300 0.230909 0.231192 0.233483 0.255120 0.240438 0.201888 0.206667
chargesum: 0.00000
title: Mulliken charges with hydrogens summed into heavy atoms:
elementType: F O O C C C C C C C C C C C C C C C C C C C C C
charge: -0.203701 -0.255567 -0.079367 -0.132122 0.209901 -0.094471 0.183381 0.371422 0.117972 -0.011267 0.095799 0.335547 0.020089 -0.211399 -0.097683 -0.110234 -0.086486 -0.171815 0.169655 -0.016675 -0.026134 -0.001697 -0.141533 0.136383
polarizability: 3.63040667e+02 1.92908325e+01 2.50773121e+02 -9.39503295e+00 7.24207671e-01 1.37774821e+02
1716.lowfreq: 0.0003 0.0006 0.0008 2.8722 7.3793 8.0781 35.0858 38.9636 63.5962
frequency: 35.0647 38.9350 63.5947 85.6369 91.2993 98.0368 117.3220 141.1840 156.8268 165.9708 190.4105 198.9342 214.3543 248.3738 252.5802 274.6398 285.3917 303.7338 321.0860 331.5822 342.1683 364.1047 382.7586 386.2984 410.7226 441.5985 460.8800 479.2358 485.7695 499.8012 519.5765 556.8245 561.2414 580.7822 604.1290 621.2794 627.4450 635.6624 698.9684 713.3882 737.4254 751.2347 762.0333 775.3159 803.4355 809.5870 865.0068 876.6215 884.9072 885.9790 903.4478 916.7057 955.6947 961.1775 969.0654 992.3874 1001.1154 1023.6798 1028.0397 1037.2326 1038.6535 1045.7591 1059.1573 1080.5771 1100.9821 1106.0800 1110.5303 1130.5412 1146.4427 1176.1227 1178.4723 1193.6663 1201.8969 1212.3290 1242.5780 1257.6771 1268.9198 1286.8757 1301.8500 1354.2384 1359.7427 1364.0431 1373.5242 1386.4047 1397.9251 1401.9004 1407.1977 1413.2024 1428.2159 1434.0831 1449.1201 1458.3751 1463.5509 1472.3243 1476.9477 1482.8654 1485.3318 1499.4626 1512.7883 1566.3322 1584.7116 1591.5512 1614.2270 1622.6087 2931.9379 2956.3153 2978.7475 2995.2675 3011.2630 3051.7986 3075.7846 3077.0301 3099.8240 3112.8386 3117.8163 3125.0397 3135.3543 3146.4900 3156.1313 3170.0661 3170.5423 3181.4451 3542.6502
redmass: 4.0902 5.1396 3.5882 4.3167 3.0997 3.0905 3.9803 1.3663 2.3376 2.6336 3.0086 3.1802 2.9689 4.2758 4.9040 1.2514 4.3868 4.6817 2.0897 1.8701 3.0204 3.8249 4.2538 2.6742 4.6782 4.3208 4.7592 4.7877 5.9433 5.4124 4.3387 4.0063 5.3690 4.3613 5.6100 4.2852 4.9698 4.4925 4.5186 4.6765 3.6165 4.2042 1.8138 1.6039 4.3557 2.6799 4.6015 1.8140 3.6862 1.4811 2.8178 5.5056 2.9864 1.5047 1.3240 1.3299 3.1919 3.1390 4.6710 1.5775 1.5259 2.2010 1.9609 2.6200 1.8595 1.5507 1.7569 2.3636 1.4302 1.0800 1.4516 2.0142 1.3663 1.4698 2.0758 2.0152 2.2766 2.0662 1.3899 2.7193 2.3493 3.2245 1.6840 2.4763 2.4747 1.3079 1.5854 3.1479 1.1260 3.1266 2.3998 1.0706 1.1023 1.1454 1.0714 2.2144 1.2121 1.7384 1.6610 6.8765 7.3210 6.3672 6.4894 7.1609 1.0339 1.0843 1.0421 1.0403 1.1025 1.0957 1.0850 1.0944 1.0978 1.0993 1.0942 1.0864 1.0899 1.0869 1.0949 1.0983 1.0918 1.0987 1.0661
irintensity: 0.2623 1.0079 1.3271 0.5518 2.1580 4.0149 0.5162 0.7869 1.5308 2.5012 2.0247 0.9948 2.0879 1.8273 5.0659 0.3918 5.4955 0.4359 35.2146 80.5014 0.7937 1.7055 4.4853 6.1548 0.3525 2.3228 1.1408 3.5575 2.3978 5.8385 2.1057 2.6388 1.4446 8.1747 6.2165 4.2158 2.0058 1.6113 3.3461 2.5175 10.3737 8.3040 106.0727 24.4644 2.6562 34.8011 12.8935 2.1633 28.0438 1.3270 8.4799 29.1741 55.0113 13.5423 0.7001 0.1594 7.3780 41.4870 73.1302 3.4720 7.0845 6.9986 9.2833 1.9670 2.9766 3.2790 7.1499 6.3396 11.3936 0.2782 12.6222 28.0135 29.2670 13.6094 4.7367 0.7015 4.6111 2.8462 10.8881 19.4331 6.5972 49.7705 20.9764 5.7867 1.5368 27.3508 5.2615 0.7711 1.5144 24.5407 15.3582 11.6976 3.2328 24.2451 8.6526 5.7119 13.0449 12.4117 19.3242 16.4573 4.1093 5.4154 11.4724 5.6728 74.8105 56.7259 29.0425 15.1500 61.4889 15.5940 19.4437 13.4461 24.4071 11.3007 8.5999 3.3153 11.0689 5.3979 29.6390 21.4519 9.8210 15.3771 8.4568
temp: 298.150 k
press: 1.00000 atm
elementType: 9 8 8 6 6 6 6 6 6 6 6 6 6 6 6 6 6 6 6 6 6 6 6 6 1 1 1 1 1 1 1 1 1 1 1 1 1 1 1 1 1 1 1
symmnumber: 1
zpe: 895427.6 jmol-1
zpe.correction: 0.341050 hartree
zpe.thermalcorrener: 0.362154 hartree
zpe.thermalcorrenthalpy: 0.363098 hartree
zpe.thermalcorrgfe: 0.292072 hartree
zpe.sumelectzpe: -1060.223164 hartree
zpe.sumelectthermal: -1060.202060 hartree
zpe.sumelectthermalent: -1060.201116 hartree
zpe.sumelectthermalfe: -1060.272142 hartree
dipole: 0.2511 -1.3828 -0.2652
dipole: 1.4302
quadrupole: -124.2329 -130.1111 -144.4248
quadrupole: 8.2733 1.4973 -9.0666
quadrupole: 8.6900 2.8119 -11.5018 8.2733 1.4973 -9.0666
hfenergy: -1060.5642145 hartree
pointgroup: C01 [X(C21H19F1O2)]
dipole: -0.0779189 0.5431079 -0.1248795 debye
polarizability: 363.5451869|16.0594296|249.447876|14.7822406|-4.3891368|138.595546 unknown
InChI: InChI=1S/C21H19FO2/c1-11-13-9-6-10-16(22)17(13)12(2)18-14-7-4-5-8-15(14)21(24-3)20(23)19(11)18/h4-10,20-21,23H,1-3H3
charge 0 multiplicity 1
43 atoms
F  3.342151 -2.666512 0.835271
O  -2.217579 1.449717 1.770789
O  -1.785467 2.04955 -1.949945
C  -1.335086 1.890319 -0.543552
C  -0.084486 1.028482 -0.405148
C  -2.50876 1.365797 0.323889
C  -0.255543 -0.372031 -0.067738
C  -2.764261 -0.085179 -0.008897
C  -1.634433 -0.932737 -0.207003
C  1.188294 1.600071 -0.531272
C  0.85306 -1.150776 0.336436
C  2.353353 0.789543 -0.255498
C  2.17884 -0.581798 0.203472
C  -4.075373 -0.576507 -0.181359
C  -1.873399 -2.266344 -0.642871
C  1.37568 3.037827 -0.992951
C  0.661181 -2.497016 1.025674
C  3.673638 1.337153 -0.380318
C  3.395411 -1.299877 0.46306
C  -4.297023 -1.916442 -0.56747
C  -3.185325 -2.755194 -0.813624
C  4.810877 0.585015 -0.082036
C  4.673054 -0.766837 0.339866
C  -2.179729 2.822179 2.284497
H  -1.115964 2.925616 -0.241551
H  -3.400883 1.987142 0.089435
H  -4.923344 0.09811 -0.015051
H  -1.027244 -2.916205 -0.882672
H  1.766326 3.684314 -0.183132
H  2.09936 3.088017 -1.826806
H  0.439964 3.473358 -1.370599
H  -0.387196 -2.636985 1.327453
H  0.963066 -3.355165 0.397984
H  1.284171 -2.545857 1.933739
H  -1.899273 1.144382 -2.340791
H  3.793073 2.371128 -0.712207
H  -5.316572 -2.295197 -0.696312
H  -3.339106 -3.786059 -1.15142
H  5.809757 1.02155 -0.180438
H  5.540467 -1.397159 0.554478
H  -2.190942 2.728043 3.382002
H  -3.067069 3.40302 1.953713
H  -1.259864 3.362042 1.979803
