program: Gaussian 09
title: 000186396
version: EM64L-G09RevD.01
frameworkgroup: C1[X(C13H4Cl3F5O)]
method: RPBEPBE
basis: SDD
operation: Freq
keyword: #p
keyword: freq=noraman
keyword: PBEPBE/SDD
title: #p freq=noraman PBEPBE/SDD
converged: YES YES NO NO
title: Mulliken charges:
elementType: Cl Cl Cl F F F F F O C C C C C C C C C C C C C H H H H
charge: 0.003170 -0.002043 0.042658 -0.147550 -0.147737 -0.139930 -0.139950 -0.137153 -0.259281 0.231417 -0.397006 0.132896 0.130628 0.417953 0.063277 0.063351 0.127314 -0.291819 -0.402214 -0.032085 -0.052570 -0.123879 0.244218 0.244210 0.283580 0.288544
chargesum: 0.00000
title: Mulliken charges with hydrogens summed into heavy atoms:
elementType: Cl Cl Cl F F F F F O C C C C C C C C C C C C C
charge: 0.003170 -0.002043 0.042658 -0.147550 -0.147737 -0.139930 -0.139950 -0.137153 -0.259281 0.231417 0.091422 0.132896 0.130628 0.417953 0.063277 0.063351 0.127314 -0.008238 -0.113670 -0.032085 -0.052570 -0.123879
polarizability: 2.66761850e+02 1.00422987e+01 1.55353742e+02 -3.08834858e-01 -4.38488994e-01 1.19889425e+02
1716.lowfreq: -3.9712 -1.7214 -0.0009 0.0011 0.0014 4.3324 9.5269 17.9837 30.5862
frequency: 9.2438 17.9268 30.5844 61.0815 83.8493 91.7693 117.1356 121.1972 158.0090 172.2391 191.4488 196.7982 202.5354 212.8865 253.5998 257.6129 275.0012 283.2697 287.4664 313.5925 322.1603 330.1260 372.5416 373.6533 425.4981 426.5037 443.0934 477.9723 510.9025 527.6026 542.2405 586.5079 598.7577 614.7210 633.0394 684.3133 689.5461 701.4115 753.6492 761.8711 832.4665 865.5687 874.1233 886.2371 932.4977 969.7259 1000.6506 1030.0859 1074.8685 1091.7256 1129.6914 1193.4776 1224.8104 1228.3990 1241.5471 1352.5610 1372.9775 1374.1424 1393.7883 1395.8657 1428.9558 1460.1851 1469.5831 1474.7481 1555.8614 1593.9258 1609.5181 1628.6042 2996.6814 3060.4639 3184.6004 3188.1325
redmass: 16.4787 14.9136 14.5170 12.1684 14.5755 14.6278 17.8506 18.5016 18.8881 10.0957 21.6967 32.2968 4.9344 14.7339 13.5766 18.4663 10.4390 3.7061 6.7002 15.6348 7.2047 25.0846 12.6119 11.7617 12.2230 14.4431 9.5172 14.3550 5.0853 6.8787 12.5270 4.4575 7.6242 9.2126 12.1588 3.7196 9.6226 5.9799 11.7805 11.0115 1.5291 1.5209 10.4843 5.1498 8.7721 10.1772 5.0376 2.1616 8.0912 7.7073 1.7467 1.5954 1.1414 6.6409 8.8797 4.4465 7.9735 1.4005 7.1865 5.7481 3.3856 9.3935 10.4212 1.1284 8.8336 7.3439 10.5839 11.9281 1.0559 1.1084 1.0921 1.0932
irintensity: 0.0820 0.2507 0.3145 0.2975 0.4546 0.4728 0.1413 0.0014 0.0015 0.5787 0.5486 0.0209 0.0153 2.9384 0.7322 0.0545 0.2371 8.0381 0.2974 5.7150 2.2614 1.4772 0.0031 1.1960 9.2006 0.0178 1.8382 1.5781 0.0154 4.8944 0.3681 2.9512 3.0798 16.5978 0.0007 4.9042 47.0715 0.2330 25.0707 62.9362 11.1098 26.1924 25.6021 117.8240 79.4277 155.3179 16.8126 48.3260 0.0071 44.8487 139.5879 12.2419 15.3420 134.6263 60.4647 42.5738 10.0026 126.1757 54.8813 63.5919 114.6900 244.4635 103.4093 1.3946 111.4265 178.2005 0.4273 32.5096 21.2738 5.4972 3.8088 1.4866
temp: 298.150 k
press: 1.00000 atm
elementType: 17 17 17 9 9 9 9 9 8 6 6 6 6 6 6 6 6 6 6 6 6 6 1 1 1 1
symmnumber: 1
zpe: 366235.7 jmol-1
zpe.correction: 0.139492 hartree
zpe.thermalcorrener: 0.159837 hartree
zpe.thermalcorrenthalpy: 0.160781 hartree
zpe.thermalcorrgfe: 0.086659 hartree
zpe.sumelectzpe: -2450.769704 hartree
zpe.sumelectthermal: -2450.749359 hartree
zpe.sumelectthermalent: -2450.748415 hartree
zpe.sumelectthermalfe: -2450.822537 hartree
dipole: 1.7339 -1.8287 0.0592
dipole: 2.5208
quadrupole: -168.6395 -138.7819 -153.4786
quadrupole: -4.1972 0.1422 -0.5144
quadrupole: -15.0062 14.8515 0.1547 -4.1972 0.1422 -0.5144
hfenergy: -2450.909196 hartree
pointgroup: C01 [X(C13H4Cl3F5O1)]
dipole: 0.6889284 -0.0355771 -0.7125124 debye
dipolederiv: -0.247152 0.01125 0.2566193 0.0142049 -0.0265932 -0.0235901 0.3266856 -0.0237446 -0.5763732 -0.2136447 -0.0085692 -0.2236852 -0.0113928 -0.0281605 -0.0229415 -0.2965748 -0.0228961 -0.6080861 -0.7068945 0.0018832 -0.0053305 0.0013024 0.0102627 -0.0006141 -0.0201624 -0.0006381 -0.0052051 -0.3475898 -0.301788 -0.0591432 -0.2354377 -0.7542267 -0.0702596 -0.0666223 -0.0708754 -0.1132608 -0.3439883 0.2917512 -0.0887329 0.2243853 -0.7366577 0.1342576 -0.0901738 0.1354316 -0.1344981 -0.4083342 -0.336867 -0.0599592 -0.4429602 -0.7415706 -0.0676294 -0.0843035 -0.0705446 -0.0930563 -0.4037079 0.3267313 -0.0934412 0.4299258 -0.7248205 0.1329007 -0.1287744 0.1364398 -0.1141139 -1.0169674 -0.0102989 -0.2483114 -0.0129255 -0.1532488 0.0004747 -0.3032996 0.0005715 -0.1582572 -2.2940069 0.0125629 0.1654769 0.017118 -0.2426545 -0.0045168 0.2618817 -0.0047932 -0.3285521 -0.2536265 -0.0000966 -0.0063047 -0.0055789 -0.1956727 0.0042605 -0.1200573 0.0043544 -0.1176508 1.2658061 -0.0058043 -0.0798885 -0.029755 0.27284 0.009354 -0.606831 0.0109868 0.4543456 0.4482321 0.4310165 0.0713247 0.1322963 0.827043 0.0650204 0.0762247 0.1026152 0.1080339 0.4432065 -0.4190245 0.1138426 -0.1199584 0.8059371 -0.1364958 0.0902709 -0.1747977 0.1328317 1.959546 -0.0095375 -0.1045271 0.0035659 0.1242342 0.0043518 0.217614 0.0034738 0.2260052 0.2431153 0.5172258 0.0106504 0.5806193 0.7554512 0.1047506 0.0339051 0.1325294 0.0649629 0.2362025 -0.5102355 0.0624879 -0.5712098 0.7300888 -0.1732419 0.0926661 -0.2017242 0.0963884 1.1433232 0.012087 0.2935658 0.014282 0.1435223 0.0012593 0.3356137 0.0012403 0.1848602 -0.5615801 -0.0006134 -0.0429132 -0.0142227 -0.1674923 -0.0047062 -0.369421 -0.0035046 -0.2836985 -0.6194645 0.0055304 0.1024289 0.0139484 -0.1280888 -0.0048547 0.2916294 -0.0054332 -0.2382654 0.4265306 -0.0149969 -0.3319977 -0.0164791 -0.0141755 0.0418663 -0.3635917 0.0420279 0.9733155 0.3438334 0.0086842 0.245477 0.0138314 -0.0043768 0.0401707 0.3763551 0.0399585 1.0008554 0.8011346 -0.0004155 0.0506466 -0.0017934 -0.0755011 -0.0194409 0.0135204 -0.0193965 -0.5458735 -0.0176771 0.029921 -0.0281396 0.0344759 -0.0034082 0.0888155 0.1379791 0.0408346 -0.0102575 -0.0201377 -0.0321638 -0.0258646 -0.0211215 -0.015371 -0.0886622 0.1414336 -0.0412449 0.0014322 0.0583539 0.0029217 0.0616182 0.00446 0.1690594 -0.0056998 0.0966086 -0.0059743 0.0303991 0.0854873 -0.0011544 -0.0358992 -0.0015809 0.17358 -0.004829 -0.0425763 -0.0048963 0.0537184 unknown
polarizability: 266.5620077|0.2096786|119.9104305|11.0957596|0.9738194|155.5325784 unknown
InChI: InChI=1S/C13H4Cl3F5O/c14-6-1-4(2-7(15)8(6)16)22-3-5-9(17)11(19)13(21)12(20)10(5)18/h1-2H,3H2
charge 0 multiplicity 1
26 atoms
Cl -4.978343 0.135761 2.869672
Cl -4.817644 -0.0948 -2.727014
Cl -6.566924 0.023167 0.025115
F  1.769624 -2.437772 -0.358799
F  1.784328 2.394142 -0.607389
F  4.427228 2.432016 0.254765
F  4.412595 -2.402664 0.503768
F  5.744403 0.032932 0.815735
O  -0.537471 0.015961 0.311147
C  1.719146 -0.022271 -0.494652
C  0.276079 -0.040146 -0.92677
C  2.416797 -1.21401 -0.205778
C  2.42403 1.18858 -0.329117
C  -1.930838 0.013564 0.154519
C  3.762686 1.224425 0.104885
C  3.755294 -1.212941 0.230124
C  4.428211 0.015014 0.387299
C  -2.595269 -0.035944 -1.09294
C  -2.668585 0.065946 1.361133
C  -4.070002 0.068295 1.307944
C  -4.004638 -0.031763 -1.110963
C  -4.768688 0.019629 0.074398
H  0.048086 0.838178 -1.558876
H  0.04613 -0.971069 -1.477849
H  -2.05783 -0.077036 -2.042303
H  -2.140003 0.103909 2.316147
