program: Gaussian 09
title: 000186421
version: EM64L-G09RevD.01
frameworkgroup: C1[X(C19H23NO3S)]
method: RPBEPBE
basis: SDD
operation: Freq
keyword: #p
keyword: freq=noraman
keyword: PBEPBE/SDD
title: #p freq=noraman PBEPBE/SDD
converged: YES YES NO NO
title: Mulliken charges:
elementType: S O O O N C C C C C C C C C C C C C C C C C C C H H H H H H H H H H H H H H H H H H H H H H H
charge: 0.896605 -0.295466 -0.538195 -0.520936 -0.331101 0.035581 -0.434299 -0.361652 -0.278637 0.590570 -0.249726 -0.696695 0.521044 -0.250120 -0.471606 -0.401302 -0.553112 -0.381273 -0.236427 -0.225986 -0.249307 -0.223219 -0.683747 -0.240951 0.234235 0.251794 0.246080 0.223506 0.227643 0.229041 0.262188 0.243044 0.229110 0.310913 0.221730 0.303144 0.205640 0.282973 0.247476 0.245121 0.226636 0.229314 0.236639 0.264700 0.219335 0.210644 0.229053
chargesum: 0.00000
title: Mulliken charges with hydrogens summed into heavy atoms:
elementType: S O O O N C C C C C C C C C C C C C C C C C C C
charge: 0.896605 -0.295466 -0.538195 -0.520936 -0.331101 0.269816 0.063575 0.089497 -0.049597 0.590570 -0.249726 0.037648 0.521044 0.060792 -0.249876 -0.098158 -0.064499 -0.133798 0.008694 0.000650 -0.019994 0.013420 0.010933 -0.011898
polarizability: 2.93584002e+02 9.33812381e+00 2.16843478e+02 1.27551258e+01 1.74981196e+01 2.15622049e+02
1716.lowfreq: -10.9021 -0.0016 -0.0015 -0.0015 8.1686 11.1490 17.7466 30.3518 35.4994
frequency: 17.6014 30.0613 35.3745 39.6087 47.7983 63.8501 84.7827 87.6100 109.4792 119.7443 130.0230 148.7409 166.9166 176.3147 188.9749 199.7366 216.7423 224.6848 241.5110 255.0474 268.1240 272.6122 286.0924 322.3148 331.1778 375.3803 401.5010 405.6542 414.2157 426.6660 431.4665 475.2913 499.6561 530.8335 547.9529 554.5614 566.9746 616.0279 622.2727 643.7689 710.9366 735.2226 737.5649 754.5534 769.8283 777.2052 778.7956 793.2259 796.2585 800.2087 812.9050 863.1644 890.6642 898.6024 920.1424 931.8936 945.0721 969.5878 973.2557 973.9341 985.2458 989.8805 991.1599 1002.8542 1009.3343 1019.1313 1027.3037 1027.8625 1030.9046 1057.3126 1063.1665 1072.0770 1077.8194 1092.0958 1111.8220 1121.4057 1137.0568 1148.0859 1172.1192 1174.2784 1194.1292 1206.5607 1211.2149 1234.4682 1235.8259 1257.1933 1287.6984 1291.1446 1308.1361 1326.4884 1337.5011 1355.5236 1376.6320 1385.7775 1386.0245 1394.0188 1398.2557 1425.1768 1443.0428 1458.4805 1463.8227 1464.8634 1469.9208 1480.4531 1486.0993 1487.5760 1488.0999 1500.3023 1566.5627 1592.3184 1604.8187 1612.0712 2967.1088 2970.6844 2982.7200 2994.9100 2996.4036 3061.8456 3065.4910 3070.9836 3082.1583 3093.1244 3100.9805 3101.1160 3103.9443 3107.8126 3119.8184 3126.2494 3130.5715 3141.2258 3142.4075 3150.2808 3160.6269 3170.8285 3180.3105
redmass: 5.1300 4.5246 4.6150 4.9010 3.8552 3.6726 4.7152 4.2313 3.1223 3.7823 5.4868 4.1805 4.5287 3.9064 7.7730 3.4822 1.7607 2.6916 2.0960 5.6075 2.7056 1.6113 4.1649 3.8172 3.6856 5.2160 3.3531 2.8778 4.4348 2.8153 4.1785 4.1591 4.7159 4.4290 4.0924 4.3752 3.6439 6.1015 4.5761 6.6848 1.7381 4.2140 7.4164 2.5274 2.3026 2.1077 1.5723 3.5853 1.2307 10.2504 3.1021 1.2512 1.3559 1.4153 5.0547 1.4987 2.1378 2.5989 2.3837 1.4120 1.3919 5.8822 5.1677 1.3416 1.3349 1.9611 1.7379 2.0664 1.8946 1.7656 1.8880 1.9265 1.9621 1.5187 1.8030 1.3923 1.4772 1.8511 1.0570 1.0643 1.1263 2.1134 1.9995 1.4058 1.3725 1.3080 1.3601 1.6246 1.4214 1.2576 1.2912 1.3728 5.5759 1.5138 2.0892 1.3176 1.8014 2.2170 2.0745 2.1757 1.0936 1.0688 1.0855 1.5805 1.1922 1.2789 1.0674 1.0982 5.8020 5.9453 7.0056 5.9015 1.0690 1.0806 1.0352 1.0354 1.0647 1.0947 1.0979 1.0531 1.0986 1.1006 1.0987 1.0943 1.0886 1.1001 1.0875 1.0877 1.0908 1.0887 1.0954 1.0940 1.1012 1.1002 1.1193
irintensity: 0.3377 0.5932 0.1540 0.1376 0.2214 3.5351 3.1291 1.3202 2.1853 1.4367 2.8149 0.5841 3.5857 1.1831 3.7563 1.3212 3.0568 4.3728 5.1881 3.2064 3.7502 1.2297 0.4759 0.6437 2.4818 19.7985 0.7459 0.6693 21.1435 12.2440 25.3467 16.2500 27.9191 27.4238 46.0023 26.4953 11.3004 0.5902 3.4917 6.2609 57.8216 1.0810 10.9149 30.0871 14.9492 22.2167 68.4609 30.9649 20.0683 81.4265 18.8319 1.4263 1.1415 15.9936 79.6885 7.8841 1.8805 2.3189 11.1867 5.8047 0.4720 0.2493 1.5633 0.0602 3.1839 6.5174 8.9323 10.3666 9.4413 3.2278 8.5860 12.9191 56.4553 3.2589 9.8464 6.7832 1.6784 1.2434 0.1518 2.3652 1.3575 13.2295 14.0237 4.6577 2.1970 9.7662 7.8172 12.9592 1.1450 5.8727 2.8397 5.0885 6.4844 11.1768 13.2824 27.8933 4.6967 5.1536 13.5032 26.5038 13.4660 15.7448 10.9707 6.3520 6.4376 19.8738 4.2130 9.4438 0.9484 1.7607 2.7916 2.2601 19.6094 33.3979 37.0402 16.9984 18.3087 2.0949 10.4217 17.5443 26.8695 23.0718 16.3418 20.8885 9.9597 10.0943 4.2063 3.7495 4.4088 12.5330 26.4187 3.1118 38.5185 27.8989 24.4545
temp: 298.150 k
press: 1.00000 atm
elementType: 16 8 8 8 7 6 6 6 6 6 6 6 6 6 6 6 6 6 6 6 6 6 6 6 1 1 1 1 1 1 1 1 1 1 1 1 1 1 1 1 1 1 1 1 1 1 1
symmnumber: 1
zpe: 989747.7 jmol-1
zpe.correction: 0.376975 hartree
zpe.thermalcorrener: 0.401470 hartree
zpe.thermalcorrenthalpy: 0.402414 hartree
zpe.thermalcorrgfe: 0.321334 hartree
zpe.sumelectzpe: -1414.291582 hartree
zpe.sumelectthermal: -1414.267087 hartree
zpe.sumelectthermalent: -1414.266143 hartree
zpe.sumelectthermalfe: -1414.347223 hartree
dipole: 0.2420 -0.1668 -4.2493
dipole: 4.2595
quadrupole: -130.0485 -160.7630 -155.6651
quadrupole: -6.6773 -3.9335 11.3797
quadrupole: 18.7771 -11.9374 -6.8396 -6.6773 -3.9335 11.3797
hfenergy: -1414.6685565 hartree
pointgroup: C01 [X(C19H23N1O3S1)]
dipole: 0.1052828 -0.093742 -1.6698659 debye
polarizability: 293.0379075|11.034773|217.8979863|12.6040338|17.7736414|215.1136347 unknown
InChI: InChI=1S/C19H23NO3S/c1-3-16-9-7-8-12-19(16)24(21,22)20(13-18-14-23-18)15(2)17-10-5-4-6-11-17/h4-12,15,18H,3,13-14H2,1-2H3
charge 0 multiplicity 1
47 atoms
S  0.819647 -0.286452 1.732697
O  0.70943 3.7577 -1.452513
O  0.100827 -1.736089 1.920625
O  1.394857 0.477644 3.061972
N  -0.368651 0.810031 0.70696
C  -0.160081 2.659338 -0.887781
C  0.274669 2.14389 0.478603
C  0.662102 2.389621 -2.105074
C  -1.790603 0.912611 1.249022
C  -2.755396 0.086766 0.395706
C  2.286905 -0.419797 0.517228
C  -1.938848 0.632791 2.767678
C  2.165953 -1.069866 -0.734104
C  3.479957 0.132115 1.019434
C  -3.76839 0.747403 -0.342934
C  -2.681725 -1.329381 0.34633
C  0.901577 -1.723303 -1.270262
C  3.363433 -1.12089 -1.503354
C  4.644437 0.052921 0.226438
C  -4.696865 0.013272 -1.117106
C  -3.606515 -2.062737 -0.428278
C  4.579031 -0.574204 -1.039402
C  0.836394 -3.237083 -0.928137
C  -4.617011 -1.396625 -1.162579
H  -1.235521 2.838865 -1.01823
H  0.019078 2.877852 1.270846
H  1.373484 2.037885 0.469034
H  0.180194 2.369627 -3.089341
H  1.58223 1.800606 -2.004149
H  -2.051672 1.980678 1.101225
H  -1.718936 -0.420508 3.007252
H  -1.260879 1.273442 3.358759
H  -2.97985 0.843664 3.06863
H  3.480881 0.601717 2.009346
H  -3.839784 1.842911 -0.307826
H  -1.896377 -1.847671 0.909577
H  0.884183 -1.60005 -2.370255
H  0.004742 -1.218185 -0.874933
H  3.324452 -1.606463 -2.485955
H  5.584755 0.47596 0.593476
H  -5.476691 0.53877 -1.679947
H  -3.541181 -3.156477 -0.457218
H  5.476182 -0.637216 -1.664896
H  0.786771 -3.377831 0.164694
H  -0.069036 -3.684575 -1.376956
H  1.71827 -3.777332 -1.318417
H  -5.333428 -1.970148 -1.761585
